{"text_format":"1","workbook":"xlsx","n_sheets":14,"sheets":["Text","Graphs","Settings","TheArtOfExcel ©","DashBoard","Opel","BMW","AUDI","Toyota","Nissan","Honda","Ford","Jeep","Info_Read-me"],"not_rendered":{"charts":10,"images":17,"macros":1,"external_links":1,"defined_names":3,"comments":0,"pivot_tables":0},"unopened":[],"bounds":{"document_bytes":16777216,"sheet_cells":100000,"rows_first":2000,"rows_last":500,"rows_between":2000,"halvings":0,"cell_chars":16384,"cell_head_chars":4096},"cells_cut":0,"cells_raw":0,"read":"whole","date_system":"1900"}

{"sheet":"Text","index":0,"n_rows":8,"n_cols":4,"rows_kept":8,"cut":false,"hidden":true,"merged":[]}
[null,null,"LookUP value",{"$f":"Settings!C7&\"|\"&Graphs!B7","v":"Opel|Opel Adam"}]
[null,null,"TextForIN"]
[null,null,"TextForOUT",{"$f":"IFERROR(VLOOKUP(D1,B:C,2,0),\"There is no comment\")","v":"There is no comment"}]
[null,null,"Ther is something to input?",{"$f":"LEN(TRIM(D2))","v":0}]
[]
[]
[]
[null,"LookUP value","Տեքստ"]

{"sheet":"Graphs","index":1,"n_rows":65,"n_cols":21,"rows_kept":65,"cut":false,"hidden":true,"merged":[]}
[null,null,null,{"$f":"B7","v":"Opel Adam"}]
["Month for Graph",{"$f":"VALUE(Settings!B2)","v":11},null,{"$f":"IF(B6=2,D17,D25)","v":"STOCK"},{"$f":"IF(LEN(E15)>0,TEXT(E14,\"mmm-yy\"),\"\")","v":"Nov-17"},{"$f":"IF(LEN(F15)>0,TEXT(F14,\"mmm-yy\"),\"\")","v":"Nov-18"},"Nov-19","Nov-20","Nov-21","Jan-22","Feb-22","Mar-22","Apr-22","May-22","Jun-22","Jul-22","Aug-22","Sep-22","Oct-22","Nov-22",""]
["Year for Graph",{"$f":"Settings!B3","v":"2022"},null,"Plan",{"$f":"IF($B$6=2,E18,E26)","v":111},{"$f":"IF($B$6=2,F18,F26)","v":273},403,443,262,157,357,410,452,398,467,429,417,225,449,462,"0"]
["for lookup",{"$f":"B3&\"|\"&B2","v":"2022|11"},null,null,{"$f":"IF($B$6=2,E19,E27)","v":111},{"$f":"IF($B$6=2,F19,F27)","v":273},403,443,262,157,357,410,452,398,467,429,417,225,449,462,"0"]
["togh graf",{"$f":"Settings!B6","v":6}]
["Stock-Flow /1 flow,2 stock/",{"$f":"VLOOKUP(Settings!D7,Settings!E7:I20,4,0)","v":2}]
["vernagir",{"$f":"IFERROR(HLOOKUP(\"Hodvac\",TheDate,B5,0),\"\")","v":"Opel Adam"}]
[]
[]
[]
[]
[]
[]
[null,null,null,null,{"$f":"IFERROR(HLOOKUP(E17,TheDate,Settings!$B$10,0),\"0\")","v":"2017-11-30"},{"$f":"IFERROR(HLOOKUP(F17,TheDate,Settings!$B$10,0),\"0\")","v":"2018-11-30"},{"$f":"IFERROR(HLOOKUP(G17,TheDate,Settings!$B$10,0),\"0\")","v":"2019-11-30"},{"$f":"IFERROR(HLOOKUP(H17,TheDate,Settings!$B$10,0),\"0\")","v":"2020-11-30"},{"$f":"IFERROR(HLOOKUP(I17,TheDate,Settings!$B$10,0),\"0\")","v":"2021-11-30"},{"$f":"IFERROR(HLOOKUP(J17,TheDate,Settings!$B$10,0),\"0\")","v":"2022-01-31"},{"$f":"IFERROR(HLOOKUP(K17,TheDate,Settings!$B$10,0),\"0\")","v":"2022-02-28"},{"$f":"IFERROR(HLOOKUP(L17,TheDate,Settings!$B$10,0),\"0\")","v":"2022-03-31"},{"$f":"IFERROR(HLOOKUP(M17,TheDate,Settings!$B$10,0),\"0\")","v":"2022-04-30"},{"$f":"IFERROR(HLOOKUP(N17,TheDate,Settings!$B$10,0),\"0\")","v":"2022-05-31"},{"$f":"IFERROR(HLOOKUP(O17,TheDate,Settings!$B$10,0),\"0\")","v":"2022-06-30"},{"$f":"IFERROR(HLOOKUP(P17,TheDate,Settings!$B$10,0),\"0\")","v":"2022-07-31"},{"$f":"IFERROR(HLOOKUP(Q17,TheDate,Settings!$B$10,0),\"0\")","v":"2022-08-31"},{"$f":"IFERROR(HLOOKUP(R17,TheDate,Settings!$B$10,0),\"0\")","v":"2022-09-30"},{"$f":"IFERROR(HLOOKUP(S17,TheDate,Settings!$B$10,0),\"0\")","v":"2022-10-31"},{"$f":"IFERROR(HLOOKUP(T17,TheDate,Settings!$B$10,0),\"0\")","v":"2022-11-30"},{"$f":"IFERROR(HLOOKUP(U17,TheDate,Settings!$B$10,0),\"0\")","v":"0"}]
[null,null,null,null,{"$f":"$B$2","v":11},{"$f":"$B$2","v":11},{"$f":"$B$2","v":11},{"$f":"$B$2","v":11},{"$f":"$B$2","v":11},1,{"$f":"IFERROR(IF(J15+1>$B$2,\"\",J15+1),\"\")","v":2},{"$f":"IFERROR(IF(K15+1>$B$2,\"\",K15+1),\"\")","v":3},4,5,6,7,8,9,10,11,""]
[null,null,null,null,{"$f":"F16-1","v":2017},{"$f":"G16-1","v":2018},{"$f":"H16-1","v":2019},{"$f":"I16-1","v":2020},{"$f":"J16-1","v":2021},{"$f":"$B$3","v":"2022"},{"$f":"$J$16","v":"2022"},{"$f":"$J$16","v":"2022"},"2022","2022","2022","2022","2022","2022","2022","2022","2022"]
[null,null,null,"STOCK",{"$f":"E16&\"|\"&E15","v":"2017|11"},"2018|11","2019|11","2020|11","2021|11","2022|1","2022|2","2022|3","2022|4","2022|5","2022|6","2022|7","2022|8","2022|9","2022|10","2022|11","2022|"]
[null,null,null,"PL",{"$f":"IFERROR(HLOOKUP(E17,TheDate,$B$5,0),\"0\")","v":111},273,403,443,262,157,357,410,452,398,467,429,417,225,449,462,"0"]
[null,null,null,"FA",{"$f":"IFERROR(HLOOKUP(E17,TheDate,$B$5,0),\"0\")","v":111},273,403,443,262,157,357,410,452,398,467,429,417,225,449,462,"0"]
[]
[]
[]
[null,null,null,null,{"$f":"$B$2","v":11},{"$f":"$B$2","v":11},{"$f":"$B$2","v":11},{"$f":"$B$2","v":11},{"$f":"$B$2","v":11},1,{"$f":"J23+1","v":2},{"$f":"K23+1","v":3},4,5,6,7,8,9,10,11,12]
[null,null,null,null,{"$f":"F24-1","v":2017},{"$f":"G24-1","v":2018},{"$f":"H24-1","v":2019},{"$f":"I24-1","v":2020},{"$f":"J24-1","v":2021},{"$f":"$B$3","v":"2022"},{"$f":"$J$16","v":"2022"},{"$f":"$J$16","v":"2022"},"2022","2022","2022","2022","2022","2022","2022","2022","2022"]
[null,null,null,"FLOW",{"$f":"E24&\"|\"&E23","v":"2017|11"},"2018|11","2019|11","2020|11","2021|11","2022|1","2022|2","2022|3","2022|4","2022|5","2022|6","2022|7","2022|8","2022|9","2022|10","2022|11","2022|12"]
[null,null,null,"PL",{"$f":"Q36","v":297.38622754491018},{"$f":"Q43","v":286.90718562874252},{"$f":"Q50","v":285.18562874251495},{"$f":"Q57","v":310.7820895522388},{"$f":"Q64","v":243.19461077844312},{"$f":"IFERROR(HLOOKUP(J25,TheDate,$B$5,0),\"0\")","v":157},357,410,452,398,467,429,417,225,449,462,285]
[null,null,null,"FA",{"$f":"Q37","v":270.49401197604789},{"$f":"Q44","v":294.56886227544908},{"$f":"Q51","v":282.21556886227546},{"$f":"Q58","v":244.67164179104478},{"$f":"Q65","v":209.2245508982036},{"$f":"IFERROR(HLOOKUP(J25,TheDate,$B$5+1,0),\"0\")","v":371},330,104,403,301,128,214,275,165,125,242,112]
[]
[null,null,null,null,31,28,31,30,31,30,31,31,30,31,30,31,{"$f":"SUM(E29:P29)","v":365}]
[null,null,null,null,1,2,3,4,5,6,7,8,9,10,11,12]
[]
[null,null,null,null,{"$f":"IF($B$2<E$30,\"\",E$29)","v":31},{"$f":"IF($B$2<F$30,\"\",IF(OR(D34=2012,D34=2016,D34=2008,D34=2020),29,F$29))","v":28},{"$f":"IF($B$2<G$30,\"\",G$29)","v":31},30,31,30,31,31,30,31,30,""]
[null,null,null,null,{"$f":"IF($B$2<E$30,\"\",E$30)","v":1},2,3,4,5,6,7,8,9,10,11,""]
[null,null,null,{"$f":"E24","v":2017},{"$f":"$D$34","v":2017},{"$f":"$D$34","v":2017},2017,2017,2017,2017,2017,2017,2017,2017,2017,2017]
[null,null,null,null,{"$f":"E34&\"|\"&E33","v":"2017|1"},"2017|2","2017|3","2017|4","2017|5","2017|6","2017|7","2017|8","2017|9","2017|10","2017|11","2017|"]
[null,null,null,"PL",{"$f":"IFERROR(HLOOKUP(E35,TheDate,$B$5,0),\"\")","v":174},427,389,344,424,347,276,459,177,149,111,"",{"$f":"SUMPRODUCT(E36:P36,E32:P32)/SUM(E32:P32)","v":297.38622754491018}]
[null,null,null,"FA",{"$f":"IFERROR(HLOOKUP(E35,TheDate,$B$5+1,0),\"\")","v":435},180,217,169,444,105,104,217,452,188,459,"",{"$f":"SUMPRODUCT(E37:P37,E32:P32)/SUM(E32:P32)","v":270.49401197604789}]
[]
[null,null,null,null,{"$f":"IF($B$2<E$30,\"\",E$29)","v":31},{"$f":"IF($B$2<F$30,\"\",IF(OR(D41=2012,D41=2016,D41=2008,D41=2020),29,F$29))","v":28},{"$f":"IF($B$2<G$30,\"\",G$29)","v":31},30,31,30,31,31,30,31,30,""]
[null,null,null,null,{"$f":"IF($B$2<E$30,\"\",E$30)","v":1},2,3,4,5,6,7,8,9,10,11,""]
[null,null,null,{"$f":"F24","v":2018},{"$f":"$D$41","v":2018},{"$f":"$D$41","v":2018},2018,2018,2018,2018,2018,2018,2018,2018,2018,2018]
[null,null,null,null,{"$f":"E41&\"|\"&E40","v":"2018|1"},{"$f":"F41&\"|\"&F40","v":"2018|2"},{"$f":"G41&\"|\"&G40","v":"2018|3"},{"$f":"H41&\"|\"&H40","v":"2018|4"},{"$f":"I41&\"|\"&I40","v":"2018|5"},{"$f":"J41&\"|\"&J40","v":"2018|6"},{"$f":"K41&\"|\"&K40","v":"2018|7"},{"$f":"L41&\"|\"&L40","v":"2018|8"},{"$f":"M41&\"|\"&M40","v":"2018|9"},{"$f":"N41&\"|\"&N40","v":"2018|10"},{"$f":"O41&\"|\"&O40","v":"2018|11"},{"$f":"P41&\"|\"&P40","v":"2018|"}]
[null,null,null,"PL",{"$f":"IFERROR(HLOOKUP(E42,TheDate,$B$5,0),\"\")","v":241},498,199,418,460,138,422,124,182,217,273,"",{"$f":"SUMPRODUCT(E43:P43,E39:P39)/SUM(E39:P39)","v":286.90718562874252}]
[null,null,null,"FA",{"$f":"IFERROR(HLOOKUP(E42,TheDate,$B$5+1,0),\"\")","v":414},310,376,214,256,150,100,458,387,322,249,"",{"$f":"SUMPRODUCT(E44:P44,E39:P39)/SUM(E39:P39)","v":294.56886227544908}]
[]
[null,null,null,null,{"$f":"IF($B$2<E$30,\"\",E$29)","v":31},{"$f":"IF($B$2<F$30,\"\",IF(OR(D48=2012,D48=2016,D48=2008,D48=2020),29,F$29))","v":28},{"$f":"IF($B$2<G$30,\"\",G$29)","v":31},30,31,30,31,31,30,31,30,""]
[null,null,null,null,{"$f":"IF($B$2<E30,\"\",E30)","v":1},2,3,4,5,6,7,8,9,10,11,""]
[null,null,null,{"$f":"G24","v":2019},{"$f":"$D$48","v":2019},{"$f":"$D$48","v":2019},2019,2019,2019,2019,2019,2019,2019,2019,2019,2019]
[null,null,null,null,{"$f":"E48&\"|\"&E47","v":"2019|1"},{"$f":"F48&\"|\"&F47","v":"2019|2"},{"$f":"G48&\"|\"&G47","v":"2019|3"},{"$f":"H48&\"|\"&H47","v":"2019|4"},{"$f":"I48&\"|\"&I47","v":"2019|5"},{"$f":"J48&\"|\"&J47","v":"2019|6"},{"$f":"K48&\"|\"&K47","v":"2019|7"},{"$f":"L48&\"|\"&L47","v":"2019|8"},{"$f":"M48&\"|\"&M47","v":"2019|9"},{"$f":"N48&\"|\"&N47","v":"2019|10"},{"$f":"O48&\"|\"&O47","v":"2019|11"},{"$f":"P48&\"|\"&P47","v":"2019|"}]
[null,null,null,"PL",{"$f":"IFERROR(HLOOKUP(E49,TheDate,$B$5,0),\"\")","v":402},"",211,297,496,275,262,245,183,336,403,"",{"$f":"SUMPRODUCT(E50:P50,E46:P46)/SUM(E46:P46)","v":285.18562874251495}]
[null,null,null,"FA",{"$f":"IFERROR(HLOOKUP(E49,TheDate,$B$5+1,0),\"\")","v":425},"",500,424,287,131,131,364,217,273,324,"",{"$f":"SUMPRODUCT(E51:P51,E46:P46)/SUM(E46:P46)","v":282.21556886227546}]
[]
[null,null,null,null,{"$f":"IF($B$2<E$30,\"\",E$29)","v":31},{"$f":"IF($B$2<F$30,\"\",IF(OR(D55=2012,D55=2016,D55=2008,D55=2020),29,F$29))","v":29},{"$f":"IF($B$2<G$30,\"\",G$29)","v":31},30,31,30,31,31,30,31,30,""]
[null,null,null,null,{"$f":"IF($B$2<E$30,\"\",E$30)","v":1},2,3,4,5,6,7,8,9,10,11,""]
[null,null,null,{"$f":"H24","v":2020},{"$f":"$D$55","v":2020},{"$f":"$D$55","v":2020},2020,2020,2020,2020,2020,2020,2020,2020,2020,2020]
[null,null,null,null,{"$f":"E55&\"|\"&E54","v":"2020|1"},{"$f":"F55&\"|\"&F54","v":"2020|2"},{"$f":"G55&\"|\"&G54","v":"2020|3"},{"$f":"H55&\"|\"&H54","v":"2020|4"},{"$f":"I55&\"|\"&I54","v":"2020|5"},{"$f":"J55&\"|\"&J54","v":"2020|6"},{"$f":"K55&\"|\"&K54","v":"2020|7"},{"$f":"L55&\"|\"&L54","v":"2020|8"},{"$f":"M55&\"|\"&M54","v":"2020|9"},{"$f":"N55&\"|\"&N54","v":"2020|10"},{"$f":"O55&\"|\"&O54","v":"2020|11"},{"$f":"P55&\"|\"&P54","v":"2020|"}]
[null,null,null,"PL",{"$f":"IFERROR(HLOOKUP(E56,TheDate,$B$5,0),\"\")","v":478},103,488,330,175,167,491,454,111,159,443,"",{"$f":"SUMPRODUCT(E57:P57,E53:P53)/SUM(E53:P53)","v":310.7820895522388}]
[null,null,null,"FA",{"$f":"IFERROR(HLOOKUP(E56,TheDate,$B$5+1,0),\"\")","v":147},364,363,130,151,228,187,216,341,445,122,"",{"$f":"SUMPRODUCT(E58:P58,E53:P53)/SUM(E53:P53)","v":244.67164179104478}]
[]
[null,null,null,null,{"$f":"IF($B$2<E$30,\"\",E$29)","v":31},{"$f":"IF($B$2<F$30,\"\",IF(OR(D62=2012,D62=2016,D62=2008,D62=2020),29,F$29))","v":28},{"$f":"IF($B$2<G$30,\"\",G$29)","v":31},30,31,30,31,31,30,31,30,""]
[null,null,null,null,{"$f":"IF($B$2<E$30,\"\",E$30)","v":1},2,3,4,5,6,7,8,9,10,11,""]
[null,null,null,{"$f":"I24","v":2021},{"$f":"$D$62","v":2021},{"$f":"$D$62","v":2021},2021,2021,2021,2021,2021,2021,2021,2021,2021,2021]
[null,null,null,null,{"$f":"E62&\"|\"&E61","v":"2021|1"},{"$f":"F62&\"|\"&F61","v":"2021|2"},{"$f":"G62&\"|\"&G61","v":"2021|3"},{"$f":"H62&\"|\"&H61","v":"2021|4"},{"$f":"I62&\"|\"&I61","v":"2021|5"},{"$f":"J62&\"|\"&J61","v":"2021|6"},{"$f":"K62&\"|\"&K61","v":"2021|7"},{"$f":"L62&\"|\"&L61","v":"2021|8"},{"$f":"M62&\"|\"&M61","v":"2021|9"},{"$f":"N62&\"|\"&N61","v":"2021|10"},{"$f":"O62&\"|\"&O61","v":"2021|11"},{"$f":"P62&\"|\"&P61","v":"2021|"}]
[null,null,null,"PL",{"$f":"IFERROR(HLOOKUP(E63,TheDate,$B$5,0),\"\")","v":289},105,208,205,124,152,352,331,175,453,262,"",{"$f":"SUMPRODUCT(E64:P64,E60:P60)/SUM(E60:P60)","v":243.19461077844312}]
[null,null,null,"FA",{"$f":"IFERROR(HLOOKUP(E63,TheDate,$B$5+1,0),\"\")","v":131},199,161,371,163,180,178,195,158,121,454,"",{"$f":"SUMPRODUCT(E65:P65,E60:P60)/SUM(E60:P60)","v":209.2245508982036}]

{"sheet":"Settings","index":2,"n_rows":234,"n_cols":132,"rows_kept":234,"cut":false,"hidden":true,"merged":[]}
[null,null,null,null,null,null,null,null,null,null,"Togi Yntrutyun",1,0]
["Month","11",null,null,null,null,null,null,null,null,null,2,{"$f":"M1+1","v":1}]
["Year","2022",null,null,null,null,null,null,null,null,null,3,{"$f":"M2+1","v":2}]
["for lookup",{"$f":"$B$3-5&\"|\"&$B$2","v":"2017|11"},{"$f":"$B$3-4&\"|\"&$B$2","v":"2018|11"},{"$f":"$B$3-3&\"|\"&$B$2","v":"2019|11"},{"$f":"$B$3-2&\"|\"&$B$2","v":"2020|11"},{"$f":"$B$3-1&\"|\"&$B$2","v":"2021|11"},{"$f":"B3&\"|\"&B2","v":"2022|11"},null,null,null,null,4,3]
["start togh for graf",1,null,null,null,null,null,null,null,null,null,5,4]
["togh graf",{"$f":"IF(B11>B12,B12,B11)+VLOOKUP(B5,L1:M9,2,0)","v":6},null,null,null,null,null,null,null,null,null,6,5]
["sheet",{"$f":"\"'\"&C7&\"'!\"","v":"'Opel'!"},{"$f":"VLOOKUP(D7,E7:F29,2,0)","v":"Opel"},1,2,{"$f":"MID(I7,SEARCH(\"]\",I7,1)+1,SEARCH(\"!\",I7,1)-2-SEARCH(\"]\",I7,1))","v":"BMW"},{"$f":"BMW!$A$1","v":"BMW sells"},2,{"$f":"CELL(\"address\",BMW!$A$1)","v":"'[Report Template renewed 2022.xlsm]BMW'!$A$1"},null,null,7,6]
["shift for row",34,null,null,3,"AUDI",{"$f":"AUDI!$A$1","v":"Audi sells"},2,{"$f":"CELL(\"address\",AUDI!$A$1)","v":"'[Report Template renewed 2022.xlsm]AUDI'!$A$1"},null,null,8,7]
[null,null,null,null,1,"Opel",{"$f":"Opel!$A$1","v":"Opel sells"},2,{"$f":"CELL(\"address\",Opel!$A$1)","v":"'[Report Template renewed 2022.xlsm]Opel'!$A$1"},null,null,9,8]
["vernagir togh",5,null,null,5,"Nissan",{"$f":"Nissan!$A$1","v":"Nissan sells"},2,{"$f":"CELL(\"address\",Nissan!$A$1)","v":"'[Report Template renewed 2022.xlsm]Nissan'!$A$1"}]
["start togh",6,null,null,7,"Ford",{"$f":"Ford!$A$1","v":"Ford sells"},2,{"$f":"CELL(\"address\",Ford!$A$1)","v":"'[Report Template renewed 2022.xlsm]Ford'!$A$1"}]
["maximal togh",{"$f":"IF(MAX(B36:B185)-7<6,6,MAX(B36:B185)-7)","v":52},null,null,4,"Toyota",{"$f":"Toyota!$A$1","v":"Toyota sells"},2,{"$f":"CELL(\"address\",Toyota!$A$1)","v":"'[Report Template renewed 2022.xlsm]Toyota'!$A$1"}]
[null,null,null,null,6,"Honda",{"$f":"Honda!$A$1","v":"Honda sells"},2,{"$f":"CELL(\"address\",Honda!$A$1)","v":"'[Report Template renewed 2022.xlsm]Honda'!$A$1"}]
[null,null,null,null,8,"Jeep",{"$f":"Jeep!$A$1","v":"Jeep sells"},2,{"$f":"CELL(\"address\",Jeep!$A$1)","v":"'[Report Template renewed 2022.xlsm]Jeep'!$A$1"}]
[]
[]
[]
[1,{"$f":"B19-1","v":2011}]
[{"$f":"A18+1","v":2},2012]
[{"$f":"A19+1","v":3},2013]
[4,2014]
[5,2015]
[6,2016]
[7,2017]
[8,2018]
[9,2019]
[10,2020]
[11,{"$f":"B29-1","v":2021}]
[12,{"$f":"YEAR(NOW())","v":2022}]
[]
[1,null,"Hodvac",{"$f":"D34&\"|\"&D33","v":"2016|1"},"2016|2","2016|3","2016|4","2016|5","2016|6","2016|7","2016|8","2016|9","2016|10","2016|11","2016|12","2017|1","2017|2","2017|3","2017|4","2017|5","2017|6","2017|7","2017|8","2017|9","2017|10","2017|11","2017|12","2018|1","2018|2","2018|3","2018|4","2018|5","2018|6","2018|7","2018|8","2018|9",{"$f":"AK34&\"|\"&AK33","v":"2018|10"},"2018|11","2018|12","2019|1","2019|3","2019|3","2019|4","2019|5","2019|6","2019|7","2019|8","2019|9","2019|10","2019|11","2019|12","2020|1","2020|2","2020|3","2020|4","2020|5","2020|6","2020|7","2020|8","2020|9","2020|10","2020|11","2020|12","2021|1","2021|2","2021|3","2021|4","2021|5",{"$f":"BQ34&\"|\"&BQ33","v":"2021|6"},"2021|7","2021|8","2021|9","2021|10","2021|11","2021|12","2022|1","2022|2","2022|3","2022|4","2022|5","2022|6","2022|7","2022|8","2022|9","2022|10","2022|11","2022|12","1900|1","1900|1","1900|1","1900|1","1900|1","1900|1","1900|1","1900|1","1900|1","1900|1","1900|1","1900|1","1900|1",{"$f":"CW34&\"|\"&CW33","v":"1900|1"},"1900|1","1900|1","1900|1","1900|1","1900|1",{"$f":"DC34&\"|\"&DC33","v":"1900|1"},"1900|1","1900|1","1900|1","1900|1","1900|1","1900|1","1900|1","1900|1","1900|1","1900|1","1900|1","1900|1","1900|1","1900|1","1900|1","1900|1","1900|1","1900|1","1900|1","1900|1","1900|1","1900|1","1900|1","1900|1","1900|1"]
[{"$f":"A31+1","v":2},null,"A","B","C","D","E","F","G","H","I","J","K","L","M","N","O","P","Q","R","S","T","U","V","W","X","Y","Z","AA","AB","AC","AD","AE","AF","AG","AH","AI","AJ","AK","AL","AM","AN","AO","AP","AQ","AR","AS","AT","AU","AV","AW","AX","AY","AZ","BA","BB","BC","BD","BE","BF","BG","BH","BI","BJ","BK","BL","BM","BN","BO","BP","BQ","BR","BS","BT","BU","BV","BW","BX","BY","BZ","CA","CB","CC","CD","CE","CF","CG","CH","CI","CJ","CK","CL","CM","CN","CO","CP","CQ","CR","CS","CT","CU","CV","CW","CX","CY","CZ","DA","DB","DC","DD","DE","DF","DG","DH","DI","DJ","DK","DL","DM","DN","DO","DP","DQ","DR","DS","DT","DU","DV","DW","DX","DY","DZ"]
[{"$f":"A32+1","v":3},"sheet",{"$f":"B7","v":"'Opel'!"},{"$f":"MONTH(D35)","v":1},{"$f":"MONTH(E35)","v":2},3,4,5,6,7,8,9,10,11,12,1,2,3,4,5,6,7,8,9,10,11,12,1,2,3,4,5,6,7,8,9,{"$f":"MONTH(AK35)","v":10},11,12,1,3,3,4,5,6,7,8,9,10,11,12,1,2,3,4,5,6,7,8,9,10,11,12,1,2,3,4,5,{"$f":"MONTH(BQ35)","v":6},7,8,9,10,11,12,1,2,3,4,5,6,7,8,9,10,11,12,1,1,1,1,1,1,1,1,1,1,1,1,1,{"$f":"MONTH(CW35)","v":1},1,1,1,1,1,{"$f":"MONTH(DC35)","v":1},1,1,1,1,1,1,1,1,1,1,1,1,1,1,1,{"$f":"MONTH(DS35)","v":1},1,1,1,1,1,1,1,1,1]
[4,"shift for row",{"$f":"B8","v":34},{"$f":"YEAR(D35)","v":2016},2016,2016,2016,2016,2016,2016,2016,2016,2016,2016,2016,2017,2017,2017,2017,2017,2017,2017,2017,2017,2017,2017,2017,2018,2018,2018,2018,2018,2018,2018,2018,2018,{"$f":"YEAR(AK35)","v":2018},2018,2018,2019,2019,2019,2019,2019,2019,2019,2019,2019,2019,2019,2019,2020,2020,2020,2020,2020,2020,2020,2020,2020,2020,2020,2020,2021,2021,2021,2021,2021,{"$f":"YEAR(BQ35)","v":2021},2021,2021,2021,2021,2021,2021,2022,2022,2022,2022,2022,2022,2022,2022,2022,2022,2022,2022,1900,1900,1900,1900,1900,1900,1900,1900,1900,1900,1900,1900,1900,{"$f":"YEAR(CW35)","v":1900},1900,1900,1900,1900,1900,1900,1900,1900,1900,1900,1900,1900,1900,1900,1900,1900,1900,1900,1900,1900,1900,1900,1900,1900,1900,1900,1900,1900,1900,1900,1900]
[5,null,null,{"$f":"INDIRECT($C$33&D$32&ROW()-$C$34)","v":"2016-01-31"},"2016-02-28","2016-03-31","2016-04-30","2016-05-31","2016-06-30","2016-07-31","2016-08-31","2016-09-30","2016-10-31","2016-11-30",{"$f":"INDIRECT($C$33&O$32&ROW()-$C$34)","v":"2016-12-31"},"2017-01-31","2017-02-28","2017-03-31","2017-04-30","2017-05-31","2017-06-30","2017-07-31","2017-08-31","2017-09-30",{"$f":"INDIRECT($C$33&Y$32&ROW()-$C$34)","v":"2017-10-31"},"2017-11-30","2017-12-31","2018-01-31","2018-02-28","2018-03-31","2018-04-30","2018-05-31","2018-06-30","2018-07-31",{"$f":"INDIRECT($C$33&AI$32&ROW()-$C$34)","v":"2018-08-31"},"2018-09-30","2018-10-31","2018-11-30","2018-12-31","2019-01-31","2019-03-01","2019-03-31","2019-04-30","2019-05-31",{"$f":"INDIRECT($C$33&AS$32&ROW()-$C$34)","v":"2019-06-30"},"2019-07-31","2019-08-31","2019-09-30","2019-10-31","2019-11-30","2019-12-31","2020-01-31","2020-02-28","2020-03-31",{"$f":"INDIRECT($C$33&BC$32&ROW()-$C$34)","v":"2020-04-30"},"2020-05-31","2020-06-30","2020-07-31","2020-08-31","2020-09-30","2020-10-31","2020-11-30","2020-12-31","2021-01-31",{"$f":"INDIRECT($C$33&BM$32&ROW()-$C$34)","v":"2021-02-28"},"2021-03-31","2021-04-30","2021-05-31","2021-06-30","2021-07-31","2021-08-31","2021-09-30","2021-10-31","2021-11-30",{"$f":"INDIRECT($C$33&BW$32&ROW()-$C$34)","v":"2021-12-31"},"2022-01-31","2022-02-28","2022-03-31","2022-04-30","2022-05-31","2022-06-30","2022-07-31","2022-08-31","2022-09-30",{"$f":"INDIRECT($C$33&CG$32&ROW()-$C$34)","v":"2022-10-31"},"2022-11-30","2022-12-31","00:00:00","00:00:00","00:00:00","00:00:00","00:00:00","00:00:00","00:00:00",{"$f":"INDIRECT($C$33&CQ$32&ROW()-$C$34)","v":"00:00:00"},"00:00:00","00:00:00","00:00:00","00:00:00","00:00:00","00:00:00","00:00:00","00:00:00","00:00:00","00:00:00","00:00:00","00:00:00","00:00:00","00:00:00","00:00:00",{"$f":"INDIRECT($C$33&DG$32&ROW()-$C$34)","v":"00:00:00"},"00:00:00","00:00:00","00:00:00","00:00:00","00:00:00","00:00:00","00:00:00","00:00:00","00:00:00","00:00:00","00:00:00","00:00:00",{"$f":"INDIRECT($C$33&DT$32&ROW()-$C$34)","v":"00:00:00"},"00:00:00","00:00:00","00:00:00","00:00:00","00:00:00","00:00:00","00:00:00","00:00:00"]
[6,{"$f":"IF(LEN(C36)>1,A36,0)","v":6},{"$f":"INDIRECT($C$33&C$32&ROW()-$C$34)","v":"Opel Adam"},145,213,261,266,291,466,397,459,375,441,218,181,174,427,389,344,424,347,276,459,177,149,111,410,241,498,199,418,460,138,422,124,182,217,273,467,402,211,213,297,496,275,262,245,183,336,403,125,478,103,488,330,175,167,491,454,111,159,443,289,289,105,208,205,124,152,352,331,175,453,262,492,157,357,410,452,398,467,429,417,225,449,462,285,0,0,0,0,0,0,0,0,0,0,0,0,0,0,0,0,0,0,0,0,0,0,0,0,0,0,0,0,0,0,0,0,0,0,0,0,0,0,0,0,0,0,0,0,0]
[7,7,"Opel Admiral",470,168,341,364,103,301,246,475,467,404,281,419,435,180,217,169,444,105,104,217,452,188,459,386,414,310,376,214,256,150,100,458,387,322,249,456,425,500,310,424,287,131,131,364,217,273,324,307,147,364,363,130,151,228,187,216,341,445,122,263,131,199,161,371,163,180,178,195,158,121,454,119,371,330,104,403,301,128,214,275,165,125,242,112,0,0,0,0,0,0,0,0,0,0,0,0,0,0,0,0,0,0,0,0,0,0,0,0,0,0,0,0,0,0,0,0,0,0,0,0,0,0,0,0,0,0,0,0,0]
[8,8,"Opel Agila",313,147,178,386,101,308,217,123,395,334,375,241,271,456,395,461,258,474,389,231,310,399,130,426,427,281,293,327,277,425,465,261,419,250,327,353,383,428,149,325,261,439,179,266,192,286,488,144,230,192,398,218,343,447,353,139,200,322,447,172,484,251,160,390,256,427,454,143,432,279,189,427,256,344,264,492,317,125,420,248,324,472,135,340,0,0,0,0,0,0,0,0,0,0,0,0,0,0,0,0,0,0,0,0,0,0,0,0,0,0,0,0,0,0,0,0,0,0,0,0,0,0,0,0,0,0,0,0,0]
[9,9,"Opel Ampera",403,315,337,480,402,138,152,276,272,187,362,451,155,177,390,420,223,278,203,179,190,385,351,431,458,428,362,458,472,140,294,473,298,257,460,477,316,217,267,461,301,242,178,352,331,333,152,387,346,350,277,491,182,131,458,265,283,478,274,217,482,201,264,131,322,292,499,138,429,129,469,288,109,278,490,110,477,315,494,319,490,326,344,129,0,0,0,0,0,0,0,0,0,0,0,0,0,0,0,0,0,0,0,0,0,0,0,0,0,0,0,0,0,0,0,0,0,0,0,0,0,0,0,0,0,0,0,0,0]
[10,10,"Opel Antara",148,265,109,253,261,306,437,138,183,406,116,140,413,442,303,444,259,196,117,354,190,287,472,113,169,148,387,412,309,312,253,289,276,161,123,300,494,105,267,416,325,325,473,358,463,288,177,452,356,199,491,158,286,136,315,470,200,203,135,489,154,378,453,427,115,486,466,340,347,337,103,159,122,181,327,254,346,206,210,158,436,267,411,197,0,0,0,0,0,0,0,0,0,0,0,0,0,0,0,0,0,0,0,0,0,0,0,0,0,0,0,0,0,0,0,0,0,0,0,0,0,0,0,0,0,0,0,0,0]
[11,11,"Opel Ascona",180,118,356,153,410,273,228,163,263,337,125,367,346,247,105,214,401,345,344,143,401,334,152,158,255,357,481,378,495,301,485,273,425,243,218,113,196,111,480,202,217,260,125,462,432,411,112,386,470,198,304,470,406,171,416,140,218,304,302,481,343,445,441,131,181,486,265,440,496,260,438,414,365,107,478,211,114,409,178,273,375,302,162,130,0,0,0,0,0,0,0,0,0,0,0,0,0,0,0,0,0,0,0,0,0,0,0,0,0,0,0,0,0,0,0,0,0,0,0,0,0,0,0,0,0,0,0,0,0]
[12,{"$f":"IF(LEN(C42)>1,A42,0)","v":12},"Opel Astra",418,248,411,403,224,201,108,333,369,390,426,275,357,119,153,320,180,495,163,438,180,357,201,165,482,455,308,291,217,386,489,168,492,239,299,247,155,484,176,397,264,451,237,486,405,398,480,293,384,112,412,453,188,185,247,142,421,193,276,109,259,428,132,263,177,170,490,349,188,142,426,260,209,219,462,216,184,158,336,445,387,102,180,114,0,0,0,0,0,0,0,0,0,0,0,0,0,0,0,0,0,0,0,0,0,0,0,0,0,0,0,0,0,0,0,0,0,0,0,0,0,0,0,0,0,0,0,0,0]
[13,13,"Opel Astra Cabrio",286,249,422,481,125,348,458,314,272,288,246,223,419,168,431,344,166,364,477,419,364,329,222,147,444,153,360,454,198,216,264,488,495,103,329,131,389,260,112,204,141,490,319,345,281,454,246,318,148,335,474,428,202,266,387,401,128,279,324,489,385,348,181,386,235,157,204,128,260,192,270,103,137,230,234,492,127,237,457,172,251,267,461,413,0,0,0,0,0,0,0,0,0,0,0,0,0,0,0,0,0,0,0,0,0,0,0,0,0,0,0,0,0,0,0,0,0,0,0,0,0,0,0,0,0,0,0,0,0]
[14,14,"Opel Astra Coupe Bertone",276,382,373,413,340,122,249,441,372,280,249,410,138,131,237,412,368,244,297,284,315,421,498,274,379,309,380,122,492,478,444,330,433,456,441,178,446,473,448,256,368,376,479,426,373,225,430,407,475,406,336,457,425,324,469,363,362,186,235,137,417,200,233,329,387,257,438,387,199,500,469,157,468,487,173,364,293,209,295,277,426,290,303,279,0,0,0,0,0,0,0,0,0,0,0,0,0,0,0,0,0,0,0,0,0,0,0,0,0,0,0,0,0,0,0,0,0,0,0,0,0,0,0,0,0,0,0,0,0]
[15,15,"Opel Astra GTC",419,{"$f":"INDIRECT($C$33&E$32&ROW()-$C$34)","v":233},447,392,116,296,231,453,297,421,371,{"$f":"INDIRECT($C$33&O$32&ROW()-$C$34)","v":354},332,392,158,179,216,103,241,308,489,{"$f":"INDIRECT($C$33&Y$32&ROW()-$C$34)","v":138},140,482,228,327,346,107,412,406,449,{"$f":"INDIRECT($C$33&AI$32&ROW()-$C$34)","v":132},100,317,296,263,450,434,355,343,445,{"$f":"INDIRECT($C$33&AS$32&ROW()-$C$34)","v":315},495,195,165,291,234,106,377,199,181,{"$f":"INDIRECT($C$33&BC$32&ROW()-$C$34)","v":405},269,445,116,378,189,474,207,107,218,{"$f":"INDIRECT($C$33&BM$32&ROW()-$C$34)","v":250},179,184,248,255,192,104,390,373,196,{"$f":"INDIRECT($C$33&BW$32&ROW()-$C$34)","v":122},458,292,189,262,489,139,178,305,134,{"$f":"INDIRECT($C$33&CG$32&ROW()-$C$34)","v":477},377,197,0,0,0,0,0,0,0,{"$f":"INDIRECT($C$33&CQ$32&ROW()-$C$34)","v":0},0,0,0,0,0,0,0,0,0,0,0,0,0,0,0,0,0,0,0,0,0,0,0,0,0,0,0,0,0,0,0,0,0,0,0,0,0]
[16,16,"Opel Astra OPC",371,431,436,312,146,197,343,200,365,156,164,131,204,112,305,376,149,109,280,216,120,167,267,173,251,424,295,205,317,203,299,156,363,109,480,239,292,248,250,275,411,149,118,274,266,158,407,313,337,182,478,153,250,499,191,223,494,243,436,297,284,346,327,409,460,167,105,429,144,330,355,360,326,221,487,361,417,207,175,455,193,110,426,139,0,0,0,0,0,0,0,0,0,0,0,0,0,0,0,0,0,0,0,0,0,0,0,0,0,0,0,0,0,0,0,0,0,0,0,0,0,0,0,0,0,0,0,0,0]
[17,17,"Opel Astra Twin Top",398,276,453,163,117,211,142,258,235,495,145,379,291,285,299,316,341,238,435,488,376,414,161,417,295,373,464,319,460,452,122,141,204,212,407,213,321,260,208,194,408,492,102,307,261,309,284,453,407,178,313,151,486,345,424,497,496,234,170,132,164,334,138,180,462,209,374,223,279,500,177,184,487,143,489,295,303,437,364,203,246,253,470,457,0,0,0,0,0,0,0,0,0,0,0,0,0,0,0,0,0,0,0,0,0,0,0,0,0,0,0,0,0,0,0,0,0,0,0,0,0,0,0,0,0,0,0,0,0]
[18,18,"Opel Bedford Blitz",338,214,388,476,123,266,470,491,118,196,238,183,394,201,217,404,330,190,392,416,340,124,395,450,362,258,359,479,169,286,292,434,179,458,483,303,401,278,383,339,297,431,156,281,100,347,288,427,116,242,440,190,156,197,283,334,360,160,401,250,207,258,210,161,265,371,407,412,424,249,295,211,105,198,370,116,418,119,128,355,494,430,431,177,0,0,0,0,0,0,0,0,0,0,0,0,0,0,0,0,0,0,0,0,0,0,0,0,0,0,0,0,0,0,0,0,0,0,0,0,0,0,0,0,0,0,0,0,0]
[19,19,"Opel Calibra",497,429,465,287,413,417,377,290,488,205,280,165,123,204,454,338,486,129,245,330,253,453,184,407,268,364,355,449,390,113,265,197,247,339,239,389,255,393,300,230,393,286,192,366,450,239,286,146,340,438,382,239,106,241,192,107,226,436,392,497,206,406,214,227,300,163,465,301,308,176,318,410,186,122,365,275,143,271,267,432,218,164,184,134,0,0,0,0,0,0,0,0,0,0,0,0,0,0,0,0,0,0,0,0,0,0,0,0,0,0,0,0,0,0,0,0,0,0,0,0,0,0,0,0,0,0,0,0,0]
[20,20,"Opel Combo",146,308,180,220,277,474,335,407,320,253,105,232,135,170,478,443,282,461,252,410,491,126,414,294,209,336,208,279,120,303,206,175,247,375,329,240,411,372,341,313,247,116,134,378,287,354,298,484,211,159,307,244,190,403,324,222,235,462,212,232,458,235,500,121,184,426,495,386,312,350,225,339,363,413,363,375,452,387,363,217,195,348,117,406,0,0,0,0,0,0,0,0,0,0,0,0,0,0,0,0,0,0,0,0,0,0,0,0,0,0,0,0,0,0,0,0,0,0,0,0,0,0,0,0,0,0,0,0,0]
[21,21,"Opel Commodore",444,460,434,134,374,484,476,419,185,107,376,395,496,260,497,167,349,198,458,173,445,381,421,147,439,347,413,180,216,331,180,168,350,157,425,426,211,120,337,371,159,194,149,263,294,408,447,135,336,443,359,401,184,279,425,246,482,300,141,398,132,412,480,108,426,245,122,138,121,409,360,142,264,301,204,307,217,140,230,426,450,332,253,441,0,0,0,0,0,0,0,0,0,0,0,0,0,0,0,0,0,0,0,{"$f":"INDIRECT($C$33&DC$32&ROW()-$C$34)","v":0},0,0,0,0,0,0,0,0,0,0,0,0,0,0,0,0,{"$f":"INDIRECT($C$33&DT$32&ROW()-$C$34)","v":0},0,0,0,0,0,0,0,0]
[22,22,"Opel Corsa",293,166,274,179,251,226,389,291,325,484,135,299,300,442,228,133,263,386,440,141,341,346,155,284,223,158,316,271,288,228,159,496,133,326,241,444,417,261,302,248,250,360,485,273,433,287,189,277,307,420,157,344,314,139,192,328,346,213,218,160,335,346,452,415,233,371,249,250,212,157,453,179,358,169,434,150,249,470,428,417,162,262,120,489,0,0,0,0,0,0,0,0,0,0,0,0,0,0,0,0,0,0,0,0,0,0,0,0,0,0,0,0,0,0,0,0,0,0,0,0,0,0,0,0,0,0,0,0,0]
[23,23,"Opel Corsa OPC",177,392,315,224,124,148,390,314,326,472,477,126,297,329,237,166,389,429,107,263,193,208,491,455,498,239,180,439,386,476,184,474,286,482,268,306,420,309,406,219,327,180,284,339,253,413,155,404,125,152,333,408,106,415,374,196,478,373,146,397,482,203,289,229,459,120,412,109,346,265,442,150,382,270,110,306,306,369,340,489,238,334,315,315,0,0,0,0,0,0,0,0,0,0,0,0,0,0,0,0,0,0,0,0,0,0,0,0,0,0,0,0,0,0,0,0,0,0,0,0,0,0,0,0,0,0,0,0,0]
[24,24,"Opel Diplomat",233,324,392,311,244,462,458,428,338,417,134,285,446,123,375,242,483,447,113,304,225,102,281,165,173,187,440,455,391,432,178,435,177,489,153,265,393,442,331,375,421,370,101,130,312,483,250,155,441,207,402,470,413,409,356,472,124,294,146,412,448,381,198,166,238,122,165,397,210,128,180,467,304,455,123,348,189,418,329,459,400,473,190,398,0,0,0,0,0,0,0,0,0,0,0,0,0,0,0,0,0,0,0,0,0,0,0,0,0,0,0,0,0,0,0,0,0,0,0,0,0,0,0,0,0,0,0,0,0]
[25,25,"Opel Frontera A",355,{"$f":"INDIRECT($C$33&E$32&ROW()-$C$34)","v":409},123,408,259,491,131,351,138,471,300,{"$f":"INDIRECT($C$33&O$32&ROW()-$C$34)","v":162},436,271,359,222,178,445,332,462,370,{"$f":"INDIRECT($C$33&Y$32&ROW()-$C$34)","v":387},198,363,190,447,177,385,134,348,253,{"$f":"INDIRECT($C$33&AI$32&ROW()-$C$34)","v":287},352,147,267,415,231,294,254,301,293,{"$f":"INDIRECT($C$33&AS$32&ROW()-$C$34)","v":440},282,496,162,175,106,116,130,258,484,{"$f":"INDIRECT($C$33&BC$32&ROW()-$C$34)","v":430},405,125,204,153,211,241,329,103,163,{"$f":"INDIRECT($C$33&BM$32&ROW()-$C$34)","v":475},425,279,172,422,149,458,362,279,360,{"$f":"INDIRECT($C$33&BW$32&ROW()-$C$34)","v":208},215,432,476,473,199,240,304,103,412,{"$f":"INDIRECT($C$33&CG$32&ROW()-$C$34)","v":175},183,481,0,0,0,0,0,0,0,{"$f":"INDIRECT($C$33&CQ$32&ROW()-$C$34)","v":0},0,0,0,0,0,0,0,0,0,0,0,0,0,0,0,0,0,0,0,0,0,0,0,0,0,0,0,0,0,0,0,0,0,0,0,0,0]
[26,26,{"$f":"INDIRECT($C$33&C$32&ROW()-$C$34)","v":"Opel Frontera B"},427,224,221,164,205,459,191,186,299,222,413,105,380,339,262,355,317,490,232,322,103,195,346,467,375,306,416,169,237,319,167,358,311,422,374,306,128,385,106,107,317,274,379,184,101,226,258,265,384,352,459,104,154,409,374,223,486,168,126,453,453,362,246,363,454,267,164,345,345,250,217,469,188,157,165,136,380,373,429,222,348,102,417,200,0,0,0,0,0,0,0,0,0,0,0,0,0,0,0,0,0,0,0,0,0,0,0,0,0,0,0,0,0,0,0,0,0,0,0,0,0,0,0,0,0,0,0,0,0]
[27,27,"Opel GT",257,146,228,235,225,367,323,130,400,228,186,168,413,279,220,161,112,129,253,418,494,100,134,287,334,289,186,437,186,312,311,183,410,298,259,457,446,159,451,127,271,252,418,261,235,310,249,370,127,202,378,313,196,268,211,448,266,277,201,383,157,252,314,187,133,216,129,136,351,350,431,383,433,273,202,196,190,161,320,405,295,306,100,234,0,0,0,0,0,0,0,0,0,0,0,0,0,0,0,0,0,0,0,0,0,0,0,0,0,0,0,0,0,0,0,0,0,0,0,0,0,0,0,0,0,0,0,0,0]
[28,28,"Opel Insignia",134,470,489,119,213,310,161,302,384,216,228,202,248,145,154,467,300,430,486,425,404,273,301,315,423,260,456,446,170,211,139,245,112,344,102,329,425,393,272,412,204,173,354,186,356,251,332,307,128,300,343,311,343,265,360,238,324,293,289,130,188,200,337,157,189,338,407,102,292,309,362,414,260,232,256,158,102,483,367,175,299,290,166,241,0,0,0,0,0,0,0,0,0,0,0,0,0,0,0,0,0,0,0,0,0,0,0,0,0,0,0,0,0,0,0,0,0,0,0,0,0,0,0,0,0,0,0,0,0]
[29,29,"Opel Insignia Country Tourer",389,324,438,121,145,497,211,212,130,173,357,463,306,157,480,432,228,403,489,320,221,321,266,129,180,264,268,329,494,267,306,214,375,397,147,382,137,194,135,297,390,299,420,107,478,351,263,169,138,152,431,455,477,250,303,323,443,486,359,475,130,146,434,431,209,338,177,439,124,232,264,495,365,208,166,342,299,146,336,193,189,151,319,163,0,0,0,0,0,0,0,0,0,0,0,0,0,0,0,0,0,0,0,0,0,0,0,0,0,0,0,0,0,0,0,0,0,0,0,0,0,0,0,0,0,0,0,0,0]
[30,30,"Opel Insignia Hatchback",406,253,380,352,417,444,120,232,493,181,461,292,280,479,112,365,399,212,368,193,218,387,385,411,381,115,374,335,314,409,202,161,491,174,250,462,352,316,410,409,308,304,308,332,112,452,179,316,438,404,109,199,363,360,346,103,325,236,130,337,169,189,416,203,394,114,342,483,366,358,144,427,253,387,471,168,181,228,487,361,492,305,361,172,0,0,0,0,0,0,0,0,0,0,0,0,0,0,0,0,0,0,0,0,0,0,0,0,0,0,0,0,0,0,0,0,0,0,0,0,0,0,0,0,0,0,0,0,0]
[31,31,"Opel Insignia OPC",325,269,295,366,155,350,454,328,211,436,357,232,189,218,462,210,134,373,285,341,496,470,462,322,231,284,488,362,489,430,266,154,463,497,390,120,496,354,284,174,126,418,138,396,342,225,484,440,480,472,445,425,216,104,346,107,160,161,164,326,477,393,436,304,135,125,246,417,149,470,276,149,266,259,205,178,317,248,274,319,408,421,219,410,0,0,0,0,0,0,0,0,0,0,0,0,0,0,0,0,0,0,0,0,0,0,0,0,0,0,0,0,0,0,0,0,0,0,0,0,0,0,0,0,0,0,0,0,0]
[32,32,"Opel Insignia OPC Tourer Sports",125,218,155,117,321,293,256,321,486,419,163,237,263,123,335,171,236,130,389,395,439,183,112,398,447,431,271,482,173,488,237,269,440,148,293,378,380,275,138,367,415,222,261,374,185,363,189,245,211,242,270,425,336,342,286,205,401,287,232,159,296,118,203,425,377,494,143,267,172,319,416,399,499,330,189,103,127,192,116,398,242,224,320,102,0,0,0,0,0,0,0,0,0,0,0,0,0,0,0,0,0,0,0,0,0,0,0,0,0,0,0,0,0,0,0,0,0,0,0,0,0,0,0,0,0,0,0,0,0]
[33,33,"Opel Insignia Sports Tourer",487,461,119,485,202,199,236,182,334,425,368,205,483,368,288,478,153,477,216,450,479,294,200,486,466,251,319,381,459,340,469,398,299,195,298,279,203,329,418,260,102,245,382,245,211,397,321,401,427,374,301,172,330,411,469,196,192,441,114,348,429,452,102,210,423,328,210,102,283,260,342,355,194,236,160,489,261,461,414,147,188,174,465,388,0,0,0,0,0,0,0,0,0,0,0,0,0,0,0,0,0,0,0,0,0,0,0,0,0,0,0,0,0,0,0,0,0,0,0,0,0,0,0,0,0,0,0,0,0]
[34,34,"Opel Kadett",464,163,402,495,405,116,290,470,103,362,166,404,143,175,352,159,272,421,386,260,407,249,368,104,125,278,294,398,152,290,269,284,367,487,402,130,208,266,100,467,130,323,247,288,261,355,283,395,380,130,252,144,313,302,363,331,361,219,394,257,201,342,171,127,453,176,280,321,280,467,158,289,376,324,216,233,250,489,152,424,471,473,317,472,0,0,0,0,0,0,0,0,0,0,0,0,0,0,0,0,0,0,0,0,0,0,0,0,0,0,0,0,0,0,0,0,0,0,0,0,0,0,0,0,0,0,0,0,0]
[35,35,"Opel Kapitan",201,{"$f":"INDIRECT($C$33&E$32&ROW()-$C$34)","v":469},312,139,165,361,279,418,137,185,354,{"$f":"INDIRECT($C$33&O$32&ROW()-$C$34)","v":277},322,303,398,389,373,438,415,167,122,{"$f":"INDIRECT($C$33&Y$32&ROW()-$C$34)","v":266},500,357,257,484,328,340,195,431,397,{"$f":"INDIRECT($C$33&AI$32&ROW()-$C$34)","v":484},382,474,244,145,369,138,438,442,483,{"$f":"INDIRECT($C$33&AS$32&ROW()-$C$34)","v":300},216,302,102,452,391,200,415,424,177,{"$f":"INDIRECT($C$33&BC$32&ROW()-$C$34)","v":389},452,349,147,315,357,236,236,330,430,{"$f":"INDIRECT($C$33&BM$32&ROW()-$C$34)","v":194},184,484,499,428,332,292,324,356,259,{"$f":"INDIRECT($C$33&BW$32&ROW()-$C$34)","v":487},193,335,354,372,244,376,177,349,478,{"$f":"INDIRECT($C$33&CG$32&ROW()-$C$34)","v":214},412,426,0,0,0,0,0,0,0,{"$f":"INDIRECT($C$33&CQ$32&ROW()-$C$34)","v":0},0,0,0,0,0,0,0,0,0,0,0,0,0,0,0,0,0,0,0,0,0,0,0,0,0,0,0,0,0,0,0,0,0,0,0,0,0]
[36,36,"Opel Manta",346,239,246,177,418,196,271,382,210,234,105,352,150,199,133,285,106,148,460,209,481,107,444,465,151,371,482,325,176,481,435,438,156,464,285,110,306,478,206,424,171,360,359,376,200,345,341,122,357,453,277,292,205,310,154,104,139,268,497,258,196,106,170,117,367,239,316,134,380,235,205,140,307,218,354,214,391,165,370,451,108,323,292,266,0,0,0,0,0,0,0,0,0,0,0,0,0,0,0,0,0,0,0,0,0,0,0,0,0,0,0,0,0,0,0,0,0,0,0,0,0,0,0,0,0,0,0,0,0]
[37,37,"Opel Meriva",452,176,444,450,344,242,359,275,234,385,182,212,123,395,194,195,358,477,285,404,422,329,246,263,431,164,326,331,456,123,498,210,496,408,287,243,178,420,371,111,421,362,189,347,159,371,249,495,450,384,425,480,391,387,192,169,207,274,498,254,250,264,173,165,360,490,292,243,465,445,150,398,475,264,459,179,311,155,480,482,456,245,432,185,0,0,0,0,0,0,0,0,0,0,0,0,0,0,0,0,0,0,0,{"$f":"INDIRECT($C$33&DC$32&ROW()-$C$34)","v":0},0,0,0,0,0,0,0,0,0,0,0,0,0,0,0,0,{"$f":"INDIRECT($C$33&DT$32&ROW()-$C$34)","v":0},0,0,0,0,0,0,0,0]
[38,{"$f":"IF(LEN(C68)>1,A68,0)","v":38},"Opel Meriva OPC",110,351,150,299,258,303,457,286,249,162,302,473,231,278,101,178,233,463,344,421,220,353,102,374,164,308,311,112,243,242,138,400,386,333,428,423,361,266,453,114,283,233,305,183,189,186,414,468,395,323,170,369,371,199,295,194,340,452,131,171,190,480,229,328,145,117,142,327,126,259,188,243,160,473,308,467,294,222,135,451,316,312,278,389,0,0,0,0,0,0,0,0,0,0,0,0,0,0,0,0,0,0,0,0,0,0,0,0,0,0,0,0,0,0,0,0,0,0,0,0,0,0,0,0,0,0,0,0,0]
[39,39,"Opel Mokka",488,450,216,271,285,384,333,198,256,170,195,114,145,493,345,106,139,406,175,305,419,463,467,453,284,420,430,334,499,132,115,191,462,163,201,344,200,374,145,301,313,163,118,413,268,375,380,224,110,402,290,195,252,475,304,471,285,145,307,270,110,182,312,329,338,174,154,151,497,433,476,445,165,354,203,104,433,283,121,401,454,268,469,434,0,0,0,0,0,0,0,0,0,0,0,0,0,0,0,0,0,0,0,0,0,0,0,0,0,0,0,0,0,0,0,0,0,0,0,0,0,0,0,0,0,0,0,0,0]
[40,40,"Opel Monterey",129,224,149,468,279,381,309,323,327,196,320,496,112,355,491,426,431,303,240,348,233,443,382,262,392,250,479,330,160,433,169,369,224,372,390,230,493,480,453,173,439,488,461,336,163,445,232,281,226,253,172,476,466,160,402,346,215,222,381,464,145,408,309,104,432,224,444,332,223,341,159,444,437,160,493,489,215,194,314,181,175,378,306,230,0,0,0,0,0,0,0,0,0,0,0,0,0,0,0,0,0,0,0,0,0,0,0,0,0,0,0,0,0,0,0,0,0,0,0,0,0,0,0,0,0,0,0,0,0]
[41,41,"Opel Monza",305,337,220,478,155,328,123,274,183,272,497,205,407,449,163,341,342,141,298,483,200,146,360,321,369,253,444,331,312,251,483,367,354,477,188,273,119,498,310,109,443,261,390,259,114,221,362,130,400,332,249,302,436,395,452,270,171,410,169,466,342,398,149,143,248,235,392,474,297,332,236,422,442,450,486,315,338,421,108,224,127,208,453,229,0,0,0,0,0,0,0,0,0,0,0,0,0,0,0,0,0,0,0,0,0,0,0,0,0,0,0,0,0,0,0,0,0,0,0,0,0,0,0,0,0,0,0,0,0]
[42,42,"Opel Movano",307,153,287,149,253,332,493,204,489,347,331,482,427,229,198,428,127,498,366,341,488,225,425,472,168,177,379,134,225,311,101,246,211,405,316,227,243,294,466,288,104,176,481,458,349,244,359,113,435,350,292,331,481,185,344,388,326,230,225,384,491,160,249,210,263,416,455,325,151,127,221,379,408,325,183,215,478,448,350,113,320,337,403,175,0,0,0,0,0,0,0,0,0,0,0,0,0,0,0,0,0,0,0,0,0,0,0,0,0,0,0,0,0,0,0,0,0,0,0,0,0,0,0,0,0,0,0,0,0]
[43,43,"Opel Olympia",264,214,477,330,343,474,180,178,254,479,456,103,307,188,406,373,366,109,213,421,130,338,389,272,446,273,360,420,435,381,334,232,349,148,365,291,168,414,291,188,184,180,148,392,486,130,411,369,402,306,465,173,339,440,356,184,241,232,496,364,436,300,124,426,181,375,421,148,252,463,377,293,409,139,376,454,166,412,263,125,444,234,400,281,0,0,0,0,0,0,0,0,0,0,0,0,0,0,0,0,0,0,0,0,0,0,0,0,0,0,0,0,0,0,0,0,0,0,0,0,0,0,0,0,0,0,0,0,0]
[44,44,"Opel Olympia Rekord",393,198,267,418,181,283,329,352,271,227,267,361,245,134,436,269,391,217,196,151,433,148,259,268,149,314,239,256,255,306,431,379,451,291,237,144,189,435,308,321,322,285,210,172,119,458,484,350,489,381,339,376,294,144,459,160,324,463,142,184,371,469,180,164,113,177,235,287,203,340,413,340,398,146,365,370,353,458,237,229,223,258,414,307,0,0,0,0,0,0,0,0,0,0,0,0,0,0,0,0,0,0,0,0,0,0,0,0,0,0,0,0,0,0,0,0,0,0,0,0,0,0,0,0,0,0,0,0,0]
[45,45,"Opel Omega",386,{"$f":"INDIRECT($C$33&E$32&ROW()-$C$34)","v":217},388,327,470,371,344,250,332,401,396,{"$f":"INDIRECT($C$33&O$32&ROW()-$C$34)","v":102},326,261,407,145,104,413,221,245,376,{"$f":"INDIRECT($C$33&Y$32&ROW()-$C$34)","v":491},445,186,450,244,334,346,191,425,371,{"$f":"INDIRECT($C$33&AI$32&ROW()-$C$34)","v":428},484,329,469,320,299,206,475,494,404,{"$f":"INDIRECT($C$33&AS$32&ROW()-$C$34)","v":355},333,368,206,435,380,398,135,290,418,{"$f":"INDIRECT($C$33&BC$32&ROW()-$C$34)","v":165},203,474,455,477,110,321,463,396,394,{"$f":"INDIRECT($C$33&BM$32&ROW()-$C$34)","v":149},265,229,267,371,310,379,111,375,297,{"$f":"INDIRECT($C$33&BW$32&ROW()-$C$34)","v":416},204,185,364,200,146,133,324,439,314,{"$f":"INDIRECT($C$33&CG$32&ROW()-$C$34)","v":247},411,361,0,0,0,0,0,0,0,{"$f":"INDIRECT($C$33&CQ$32&ROW()-$C$34)","v":0},0,0,0,0,0,0,0,0,0,0,0,0,0,0,0,0,0,0,0,0,0,0,0,0,0,0,0,0,0,0,0,0,0,0,0,0,0]
[46,46,{"$f":"INDIRECT($C$33&C$32&ROW()-$C$34)","v":"Opel Rekord"},154,299,346,334,124,340,217,475,169,200,121,142,435,197,263,249,384,302,302,377,167,192,116,226,350,304,337,154,474,415,363,296,190,195,456,481,371,430,147,308,492,193,197,373,366,338,299,499,379,500,214,120,220,433,300,276,307,288,412,395,304,471,221,177,410,230,449,154,105,204,473,324,466,358,146,420,229,237,340,451,345,241,230,454,0,0,0,0,0,0,0,0,0,0,0,0,0,0,0,0,0,0,0,0,0,0,0,0,0,0,0,0,0,0,0,0,0,0,0,0,0,0,0,0,0,0,0,0,0]
[47,47,"Opel Senator",365,304,298,134,322,287,333,395,338,278,238,116,413,248,265,239,495,288,373,472,272,282,159,253,197,195,334,163,271,282,301,389,182,346,226,408,193,107,416,355,438,321,398,373,112,210,426,120,214,394,259,176,396,413,164,494,119,425,382,200,393,215,483,160,275,408,391,214,115,349,300,316,475,195,494,248,145,263,205,414,106,280,128,421,0,0,0,0,0,0,0,0,0,0,0,0,0,0,0,0,0,0,0,0,0,0,0,0,0,0,0,0,0,0,0,0,0,0,0,0,0,0,0,0,0,0,0,0,0]
[48,48,"Opel Signum",107,226,263,202,183,133,203,425,206,382,187,203,163,432,319,268,234,209,122,178,211,488,126,142,189,307,183,376,248,305,176,487,350,171,118,481,340,471,258,399,333,209,438,319,238,339,194,160,478,384,293,344,271,207,222,268,356,430,334,181,374,309,340,119,474,180,329,469,229,170,429,122,111,461,374,169,230,434,116,147,474,220,242,303,0,0,0,0,0,0,0,0,0,0,0,0,0,0,0,0,0,0,0,0,0,0,0,0,0,0,0,0,0,0,0,0,0,0,0,0,0,0,0,0,0,0,0,0,0]
[49,49,"Opel Sintra",275,261,302,329,224,163,106,497,253,165,374,128,258,394,296,205,262,361,158,121,233,291,363,158,451,391,345,217,319,259,441,444,420,286,149,466,180,195,119,141,406,213,277,349,235,364,330,432,127,445,446,250,148,342,460,317,378,243,247,165,125,161,121,471,269,465,241,286,106,499,117,334,360,227,421,106,100,353,231,278,227,309,197,474,0,0,0,0,0,0,0,0,0,0,0,0,0,0,0,0,0,0,0,0,0,0,0,0,0,0,0,0,0,0,0,0,0,0,0,0,0,0,0,0,0,0,0,0,0]
[50,50,"Opel Speedster",111,383,403,256,407,198,466,265,488,405,101,246,453,186,336,117,427,480,191,341,145,423,237,197,179,392,233,371,139,390,372,385,338,367,179,319,278,497,105,456,239,158,111,341,470,276,341,277,344,246,229,436,341,375,159,188,303,248,350,107,296,411,476,446,331,256,366,194,136,474,256,341,249,209,475,156,131,250,360,391,353,339,340,278,0,0,0,0,0,0,0,0,0,0,0,0,0,0,0,0,0,0,0,0,0,0,0,0,0,0,0,0,0,0,0,0,0,0,0,0,0,0,0,0,0,0,0,0,0]
[51,51,"Opel Super Six",128,106,175,322,191,336,493,130,362,129,226,172,360,203,365,497,118,409,368,310,478,297,346,304,436,161,124,179,155,333,489,380,412,448,267,383,361,446,227,316,234,119,174,243,211,112,241,345,146,489,286,486,365,399,342,156,337,288,364,348,414,491,390,229,332,117,183,116,495,234,412,378,297,460,214,447,465,284,251,364,333,282,145,374,0,0,0,0,0,0,0,0,0,0,0,0,0,0,0,0,0,0,0,0,0,0,0,0,0,0,0,0,0,0,0,0,0,0,0,0,0,0,0,0,0,0,0,0,0]
[52,52,"Opel Tigra",410,240,219,376,392,212,315,136,192,320,246,467,413,439,114,335,490,489,166,204,403,132,247,441,331,423,373,247,374,295,404,276,359,238,198,374,269,131,211,367,201,182,468,460,205,125,180,267,171,485,147,151,427,239,235,471,423,460,138,376,357,273,389,297,254,491,151,444,181,213,130,392,487,215,366,120,254,495,404,409,401,429,277,350,0,0,0,0,0,0,0,0,0,0,0,0,0,0,0,0,0,0,0,0,0,0,0,0,0,0,0,0,0,0,0,0,0,0,0,0,0,0,0,0,0,0,0,0,0]
[53,53,"Opel Tigra TwinTop",332,469,203,233,388,316,274,416,146,299,260,298,125,239,126,419,412,213,188,477,224,296,373,144,171,411,355,347,476,432,385,115,402,136,153,184,159,227,108,295,494,150,321,334,252,111,192,339,379,384,316,125,128,261,125,354,404,417,165,477,304,396,400,472,411,106,366,133,280,182,248,494,431,254,221,357,426,114,111,205,438,436,240,332,0,0,0,0,0,0,0,0,0,0,0,0,0,0,0,0,0,0,0,{"$f":"INDIRECT($C$33&DC$32&ROW()-$C$34)","v":0},0,0,0,0,0,0,0,0,0,0,0,0,0,0,0,0,{"$f":"INDIRECT($C$33&DT$32&ROW()-$C$34)","v":0},0,0,0,0,0,0,0,0]
[54,54,"Opel Vectra",444,214,407,464,218,132,475,171,429,408,130,332,441,328,133,329,117,393,162,366,231,213,358,229,303,487,282,418,111,265,162,248,268,207,358,210,462,469,385,215,127,312,126,329,295,171,369,127,142,337,139,444,199,353,467,197,383,313,312,497,290,406,335,326,104,295,430,172,424,284,478,216,130,334,467,278,343,311,446,405,185,124,220,412,0,0,0,0,0,0,0,0,0,0,0,0,0,0,0,0,0,0,0,0,0,0,0,0,0,0,0,0,0,0,0,0,0,0,0,0,0,0,0,0,0,0,0,0,0]
[55,55,"Opel Vectra OPC",147,{"$f":"INDIRECT($C$33&E$32&ROW()-$C$34)","v":106},209,174,410,118,200,256,431,214,407,{"$f":"INDIRECT($C$33&O$32&ROW()-$C$34)","v":243},484,239,293,435,300,359,400,432,125,{"$f":"INDIRECT($C$33&Y$32&ROW()-$C$34)","v":436},280,217,128,456,285,104,423,189,161,{"$f":"INDIRECT($C$33&AI$32&ROW()-$C$34)","v":359},290,158,426,420,286,245,139,150,421,{"$f":"INDIRECT($C$33&AS$32&ROW()-$C$34)","v":153},204,326,336,154,202,225,232,236,283,{"$f":"INDIRECT($C$33&BC$32&ROW()-$C$34)","v":422},433,139,366,272,314,426,406,405,229,{"$f":"INDIRECT($C$33&BM$32&ROW()-$C$34)","v":450},500,183,256,160,184,434,400,363,375,{"$f":"INDIRECT($C$33&BW$32&ROW()-$C$34)","v":269},166,255,481,168,327,213,436,334,367,{"$f":"INDIRECT($C$33&CG$32&ROW()-$C$34)","v":456},235,306,0,0,0,0,0,0,0,{"$f":"INDIRECT($C$33&CQ$32&ROW()-$C$34)","v":0},0,0,0,0,0,0,0,0,0,0,0,0,0,0,0,0,0,0,0,0,0,0,0,0,0,0,0,0,0,0,0,0,0,0,0,0,0]
[56,56,"Opel Vita",216,314,415,124,181,268,333,465,306,478,210,242,220,226,171,244,182,107,343,414,106,461,328,371,370,451,297,485,480,299,110,191,289,277,481,354,201,404,222,163,309,201,439,206,288,417,452,150,305,326,290,472,105,286,261,418,182,235,496,369,391,247,494,150,355,410,169,237,389,208,239,407,144,159,130,373,303,441,288,322,203,500,214,499,0,0,0,0,0,0,0,0,0,0,0,0,0,0,0,0,0,0,0,0,0,0,0,0,0,0,0,0,0,0,0,0,0,0,0,0,0,0,0,0,0,0,0,0,0]
[57,57,"Opel Vivaro",213,263,354,382,141,109,150,315,173,155,225,355,379,272,491,160,479,227,474,278,278,469,116,224,129,116,112,178,481,371,444,210,474,413,117,256,282,443,486,101,411,428,436,108,344,207,228,281,471,495,243,189,380,433,434,153,416,454,188,325,268,445,143,242,465,361,202,415,384,247,475,386,347,454,363,161,295,412,479,467,231,367,390,490,0,0,0,0,0,0,0,0,0,0,0,0,0,0,0,0,0,0,0,0,0,0,0,0,0,0,0,0,0,0,0,0,0,0,0,0,0,0,0,0,0,0,0,0,0]
[58,58,"Opel Zafira",231,302,243,483,124,352,175,154,185,161,378,151,282,454,175,216,231,305,226,171,135,356,161,436,242,258,153,337,242,386,318,135,307,233,500,258,195,494,223,184,127,143,184,295,285,451,234,167,458,197,227,320,278,353,245,113,468,151,124,132,420,269,199,168,421,496,302,453,234,256,268,313,456,221,371,395,183,220,200,458,147,272,235,171,0,0,0,0,0,0,0,0,0,0,0,0,0,0,0,0,0,0,0,0,0,0,0,0,0,0,0,0,0,0,0,0,0,0,0,0,0,0,0,0,0,0,0,0,0]
[59,59,"Opel Zafira OPC",446,205,484,468,152,449,253,410,230,311,269,394,305,216,109,326,125,446,441,410,387,274,496,470,424,121,237,188,278,270,164,181,420,418,396,297,134,349,486,395,333,310,277,306,348,475,403,332,325,392,143,307,348,242,394,116,415,448,212,314,269,216,438,188,177,228,297,482,188,314,221,275,108,168,430,290,266,123,301,401,377,329,270,460,0,0,0,0,0,0,0,0,0,0,0,0,0,0,0,0,0,0,0,0,0,0,0,0,0,0,0,0,0,0,0,0,0,0,0,0,0,0,0,0,0,0,0,0,0]
[60,0,0,0,0,0,0,0,0,0,0,0,0,0,0,0,0,0,0,0,0,0,0,0,0,0,0,0,0,0,0,0,0,0,0,0,0,0,0,0,0,0,0,0,0,0,0,0,0,0,0,0,0,0,0,0,0,0,0,0,0,0,0,0,0,0,0,0,0,0,0,0,0,0,0,0,0,0,0,0,0,0,0,0,0,0,0,0,0,0,0,0,0,0,0,0,0,0,0,0,0,0,0,0,0,0,0,0,0,0,0,0,0,0,0,0,0,0,0,0,0,0,0,0,0,0,0,0,0,0,0,0]
[61,0,0,0,0,0,0,0,0,0,0,0,0,0,0,0,0,0,0,0,0,0,0,0,0,0,0,0,0,0,0,0,0,0,0,0,0,0,0,0,0,0,0,0,0,0,0,0,0,0,0,0,0,0,0,0,0,0,0,0,0,0,0,0,0,0,0,0,0,0,0,0,0,0,0,0,0,0,0,0,0,0,0,0,0,0,0,0,0,0,0,0,0,0,0,0,0,0,0,0,0,0,0,0,0,0,0,0,0,0,0,0,0,0,0,0,0,0,0,0,0,0,0,0,0,0,0,0,0,0,0,0]
[62,0,0,0,0,0,0,0,0,0,0,0,0,0,0,0,0,0,0,0,0,0,0,0,0,0,0,0,0,0,0,0,0,0,0,0,0,0,0,0,0,0,0,0,0,0,0,0,0,0,0,0,0,0,0,0,0,0,0,0,0,0,0,0,0,0,0,0,0,0,0,0,0,0,0,0,0,0,0,0,0,0,0,0,0,0,0,0,0,0,0,0,0,0,0,0,0,0,0,0,0,0,0,0,0,0,0,0,0,0,0,0,0,0,0,0,0,0,0,0,0,0,0,0,0,0,0,0,0,0,0,0]
[63,0,0,0,0,0,0,0,0,0,0,0,0,0,0,0,0,0,0,0,0,0,0,0,0,0,0,0,0,0,0,0,0,0,0,0,0,0,0,0,0,0,0,0,0,0,0,0,0,0,0,0,0,0,0,0,0,0,0,0,0,0,0,0,0,0,0,0,0,0,0,0,0,0,0,0,0,0,0,0,0,0,0,0,0,0,0,0,0,0,0,0,0,0,0,0,0,0,0,0,0,0,0,0,0,0,0,0,0,0,0,0,0,0,0,0,0,0,0,0,0,0,0,0,0,0,0,0,0,0,0,0]
[64,0,0,0,0,0,0,0,0,0,0,0,0,0,0,0,0,0,0,0,0,0,0,0,0,0,0,0,0,0,0,0,0,0,0,0,0,0,0,0,0,0,0,0,0,0,0,0,0,0,0,0,0,0,0,0,0,0,0,0,0,0,0,0,0,0,0,0,0,0,0,0,0,0,0,0,0,0,0,0,0,0,0,0,0,0,0,0,0,0,0,0,0,0,0,0,0,0,0,0,0,0,0,0,0,0,0,0,0,0,0,0,0,0,0,0,0,0,0,0,0,0,0,0,0,0,0,0,0,0,0,0]
[65,0,0,0,{"$f":"INDIRECT($C$33&E$32&ROW()-$C$34)","v":0},0,0,0,0,0,0,0,0,0,{"$f":"INDIRECT($C$33&O$32&ROW()-$C$34)","v":0},0,0,0,0,0,0,0,0,0,{"$f":"INDIRECT($C$33&Y$32&ROW()-$C$34)","v":0},0,0,0,0,0,0,0,0,0,{"$f":"INDIRECT($C$33&AI$32&ROW()-$C$34)","v":0},0,0,0,0,0,0,0,0,0,{"$f":"INDIRECT($C$33&AS$32&ROW()-$C$34)","v":0},0,0,0,0,0,0,0,0,0,{"$f":"INDIRECT($C$33&BC$32&ROW()-$C$34)","v":0},0,0,0,0,0,0,0,0,0,{"$f":"INDIRECT($C$33&BM$32&ROW()-$C$34)","v":0},0,0,0,0,0,0,0,0,0,{"$f":"INDIRECT($C$33&BW$32&ROW()-$C$34)","v":0},0,0,0,0,0,0,0,0,0,{"$f":"INDIRECT($C$33&CG$32&ROW()-$C$34)","v":0},0,0,0,0,0,0,0,0,0,{"$f":"INDIRECT($C$33&CQ$32&ROW()-$C$34)","v":0},0,0,0,0,0,0,0,0,0,0,0,0,0,0,0,0,0,0,0,0,0,0,0,0,0,0,0,0,0,0,0,0,0,0,0,0,0]
[66,0,{"$f":"INDIRECT($C$33&C$32&ROW()-$C$34)","v":0},0,0,0,0,0,0,0,0,0,0,0,0,0,0,0,0,0,0,0,0,0,0,0,0,0,0,0,0,0,0,0,0,0,0,0,0,0,0,0,0,0,0,0,0,0,0,0,0,0,0,0,0,0,0,0,0,0,0,0,0,0,0,0,0,0,0,0,0,0,0,0,0,0,0,0,0,0,0,0,0,0,0,0,0,0,0,0,0,0,0,0,0,0,0,0,0,0,0,0,0,0,0,0,0,0,0,0,0,0,0,0,0,0,0,0,0,0,0,0,0,0,0,0,0,0,0,0,0,0]
[{"$f":"A96+1","v":67},0,0,0,0,0,0,0,0,0,0,0,0,0,0,0,0,0,0,0,0,0,0,0,0,0,0,0,0,0,0,0,0,0,0,0,0,0,0,0,0,0,0,0,0,0,0,0,0,0,0,0,0,0,0,0,0,0,0,0,0,0,0,0,0,0,0,0,0,0,0,0,0,0,0,0,0,0,0,0,0,0,0,0,0,0,0,0,0,0,0,0,0,0,0,0,0,0,0,0,0,0,0,0,0,0,0,0,0,0,0,0,0,0,0,0,0,0,0,0,0,0,0,0,0,0,0,0,0,0,0,0]
[68,0,0,0,0,0,0,0,0,0,0,0,0,0,0,0,0,0,0,0,0,0,0,0,0,0,0,0,0,0,0,0,0,0,0,0,0,0,0,0,0,0,0,0,0,0,0,0,0,0,0,0,0,0,0,0,0,0,0,0,0,0,0,0,0,0,0,0,0,0,0,0,0,0,0,0,0,0,0,0,0,0,0,0,0,0,0,0,0,0,0,0,0,0,0,0,0,0,0,0,0,0,0,0,0,0,0,0,0,0,0,0,0,0,0,0,0,0,0,0,0,0,0,0,0,0,0,0,0,0,0,0]
[69,0,0,0,0,0,0,0,0,0,0,0,0,0,0,0,0,0,0,0,0,0,0,0,0,0,0,0,0,0,0,0,0,0,0,0,0,0,0,0,0,0,0,0,0,0,0,0,0,0,0,0,0,0,0,0,0,0,0,0,0,0,0,0,0,0,0,0,0,0,0,0,0,0,0,0,0,0,0,0,0,0,0,0,0,0,0,0,0,0,0,0,0,0,0,0,0,0,0,0,0,0,0,0,0,0,{"$f":"INDIRECT($C$33&DC$32&ROW()-$C$34)","v":0},0,0,0,0,0,0,0,0,0,0,0,0,0,0,0,0,{"$f":"INDIRECT($C$33&DT$32&ROW()-$C$34)","v":0},0,0,0,0,0,0,0,0]
[70,{"$f":"IF(LEN(C100)>1,A100,0)","v":0},0,0,0,0,0,0,0,0,0,0,0,0,0,0,0,0,0,0,0,0,0,0,0,0,0,0,0,0,0,0,0,0,0,0,0,0,0,0,0,0,0,0,0,0,0,0,0,0,0,0,0,0,0,0,0,0,0,0,0,0,0,0,0,0,0,0,0,0,0,0,0,0,0,0,0,0,0,0,0,0,0,0,0,0,0,0,0,0,0,0,0,0,0,0,0,0,0,0,0,0,0,0,0,0,0,0,0,0,0,0,0,0,0,0,0,0,0,0,0,0,0,0,0,0,0,0,0,0,0,0]
[71,0,0,0,0,0,0,0,0,0,0,0,0,0,0,0,0,0,0,0,0,0,0,0,0,0,0,0,0,0,0,0,0,0,0,0,0,0,0,0,0,0,0,0,0,0,0,0,0,0,0,0,0,0,0,0,0,0,0,0,0,0,0,0,0,0,0,0,0,0,0,0,0,0,0,0,0,0,0,0,0,0,0,0,0,0,0,0,0,0,0,0,0,0,0,0,0,0,0,0,0,0,0,0,0,0,0,0,0,0,0,0,0,0,0,0,0,0,0,0,0,0,0,0,0,0,0,0,0,0,0,0]
[72,0,0,0,0,0,0,0,0,0,0,0,0,0,0,0,0,0,0,0,0,0,0,0,0,0,0,0,0,0,0,0,0,0,0,0,0,0,0,0,0,0,0,0,0,0,0,0,0,0,0,0,0,0,0,0,0,0,0,0,0,0,0,0,0,0,0,0,0,0,0,0,0,0,0,0,0,0,0,0,0,0,0,0,0,0,0,0,0,0,0,0,0,0,0,0,0,0,0,0,0,0,0,0,0,0,0,0,0,0,0,0,0,0,0,0,0,0,0,0,0,0,0,0,0,0,0,0,0,0,0,0]
[73,0,0,0,0,0,0,0,0,0,0,0,0,0,0,0,0,0,0,0,0,0,0,0,0,0,0,0,0,0,0,0,0,0,0,0,0,0,0,0,0,0,0,0,0,0,0,0,0,0,0,0,0,0,0,0,0,0,0,0,0,0,0,0,0,0,0,0,0,0,0,0,0,0,0,0,0,0,0,0,0,0,0,0,0,0,0,0,0,0,0,0,0,0,0,0,0,0,0,0,0,0,0,0,0,0,0,0,0,0,0,0,0,0,0,0,0,0,0,0,0,0,0,0,0,0,0,0,0,0,0,0]
[74,0,0,0,0,0,0,0,0,0,0,0,0,0,0,0,0,0,0,0,0,0,0,0,0,0,0,0,0,0,0,0,0,0,0,0,0,0,0,0,0,0,0,0,0,0,0,0,0,0,0,0,0,0,0,0,0,0,0,0,0,0,0,0,0,0,0,0,0,0,0,0,0,0,0,0,0,0,0,0,0,0,0,0,0,0,0,0,0,0,0,0,0,0,0,0,0,0,0,0,0,0,0,0,0,0,0,0,0,0,0,0,0,0,0,0,0,0,0,0,0,0,0,0,0,0,0,0,0,0,0,0]
[75,0,0,0,{"$f":"INDIRECT($C$33&E$32&ROW()-$C$34)","v":0},0,0,0,0,0,0,0,0,0,{"$f":"INDIRECT($C$33&O$32&ROW()-$C$34)","v":0},0,0,0,0,0,0,0,0,0,{"$f":"INDIRECT($C$33&Y$32&ROW()-$C$34)","v":0},0,0,0,0,0,0,0,0,0,{"$f":"INDIRECT($C$33&AI$32&ROW()-$C$34)","v":0},0,0,0,0,0,0,0,0,0,{"$f":"INDIRECT($C$33&AS$32&ROW()-$C$34)","v":0},0,0,0,0,0,0,0,0,0,{"$f":"INDIRECT($C$33&BC$32&ROW()-$C$34)","v":0},0,0,0,0,0,0,0,0,0,{"$f":"INDIRECT($C$33&BM$32&ROW()-$C$34)","v":0},0,0,0,0,0,0,0,0,0,{"$f":"INDIRECT($C$33&BW$32&ROW()-$C$34)","v":0},0,0,0,0,0,0,0,0,0,{"$f":"INDIRECT($C$33&CG$32&ROW()-$C$34)","v":0},0,0,0,0,0,0,0,0,0,{"$f":"INDIRECT($C$33&CQ$32&ROW()-$C$34)","v":0},0,0,0,0,0,0,0,0,0,0,0,0,0,0,0,0,0,0,0,0,0,0,0,0,0,0,0,0,0,0,0,0,0,0,0,0,0]
[76,0,0,0,0,0,0,0,0,0,0,0,0,0,0,0,0,0,0,0,0,0,0,0,0,0,0,0,0,0,0,0,0,0,0,0,0,0,0,0,0,0,0,0,0,0,0,0,0,0,0,0,0,0,0,0,0,0,0,0,0,0,0,0,0,0,0,0,0,0,0,0,0,0,0,0,0,0,0,0,0,0,0,0,0,0,0,0,0,0,0,0,0,0,0,0,0,0,0,0,0,0,0,0,0,0,0,0,0,0,0,0,0,0,0,0,0,0,0,0,0,0,0,0,0,0,0,0,0,0,0,0]
[77,0,0,0,0,0,0,0,0,0,0,0,0,0,0,0,0,0,0,0,0,0,0,0,0,0,0,0,0,0,0,0,0,0,0,0,0,0,0,0,0,0,0,0,0,0,0,0,0,0,0,0,0,0,0,0,0,0,0,0,0,0,0,0,0,0,0,0,0,0,0,0,0,0,0,0,0,0,0,0,0,0,0,0,0,0,0,0,0,0,0,0,0,0,0,0,0,0,0,0,0,0,0,0,0,0,0,0,0,0,0,0,0,0,0,0,0,0,0,0,0,0,0,0,0,0,0,0,0,0,0,0]
[78,0,0,0,0,0,0,0,0,0,0,0,0,0,0,0,0,0,0,0,0,0,0,0,0,0,0,0,0,0,0,0,0,0,0,0,0,0,0,0,0,0,0,0,0,0,0,0,0,0,0,0,0,0,0,0,0,0,0,0,0,0,0,0,0,0,0,0,0,0,0,0,0,0,0,0,0,0,0,0,0,0,0,0,0,0,0,0,0,0,0,0,0,0,0,0,0,0,0,0,0,0,0,0,0,0,0,0,0,0,0,0,0,0,0,0,0,0,0,0,0,0,0,0,0,0,0,0,0,0,0,0]
[79,0,0,0,0,0,0,0,0,0,0,0,0,0,0,0,0,0,0,0,0,0,0,0,0,0,0,0,0,0,0,0,0,0,0,0,0,0,0,0,0,0,0,0,0,0,0,0,0,0,0,0,0,0,0,0,0,0,0,0,0,0,0,0,0,0,0,0,0,0,0,0,0,0,0,0,0,0,0,0,0,0,0,0,0,0,0,0,0,0,0,0,0,0,0,0,0,0,0,0,0,0,0,0,0,0,0,0,0,0,0,0,0,0,0,0,0,0,0,0,0,0,0,0,0,0,0,0,0,0,0,0]
[80,0,0,0,0,0,0,0,0,0,0,0,0,0,0,0,0,0,0,0,0,0,0,0,0,0,0,0,0,0,0,0,0,0,0,0,0,0,0,0,0,0,0,0,0,0,0,0,0,0,0,0,0,0,0,0,0,0,0,0,0,0,0,0,0,0,0,0,0,0,0,0,0,0,0,0,0,0,0,0,0,0,0,0,0,0,0,0,0,0,0,0,0,0,0,0,0,0,0,0,0,0,0,0,0,0,0,0,0,0,0,0,0,0,0,0,0,0,0,0,0,0,0,0,0,0,0,0,0,0,0,0]
[81,0,0,0,0,0,0,0,0,0,0,0,0,0,0,0,0,0,0,0,0,0,0,0,0,0,0,0,0,0,0,0,0,0,0,0,0,0,0,0,0,0,0,0,0,0,0,0,0,0,0,0,0,0,0,0,0,0,0,0,0,0,0,0,0,0,0,0,0,0,0,0,0,0,0,0,0,0,0,0,0,0,0,0,0,0,0,0,0,0,0,0,0,0,0,0,0,0,0,0,0,0,0,0,0,0,0,0,0,0,0,0,0,0,0,0,0,0,0,0,0,0,0,0,0,0,0,0,0,0,0,0]
[82,0,0,0,0,0,0,0,0,0,0,0,0,0,0,0,0,0,0,0,0,0,0,0,0,0,0,0,0,0,0,0,0,0,0,0,0,0,0,0,0,0,0,0,0,0,0,0,0,0,0,0,0,0,0,0,0,0,0,0,0,0,0,0,0,0,0,0,0,0,0,0,0,0,0,0,0,0,0,0,0,0,0,0,0,0,0,0,0,0,0,0,0,0,0,0,0,0,0,0,0,0,0,0,0,0,0,0,0,0,0,0,0,0,0,0,0,0,0,0,0,0,0,0,0,0,0,0,0,0,0,0]
[83,0,0,0,0,0,0,0,0,0,0,0,0,0,0,0,0,0,0,0,0,0,0,0,0,0,0,0,0,0,0,0,0,0,0,0,0,0,0,0,0,0,0,0,0,0,0,0,0,0,0,0,0,0,0,0,0,0,0,0,0,0,0,0,0,0,0,0,0,0,0,0,0,0,0,0,0,0,0,0,0,0,0,0,0,0,0,0,0,0,0,0,0,0,0,0,0,0,0,0,0,0,0,0,0,0,0,0,0,0,0,0,0,0,0,0,0,0,0,0,0,0,0,0,0,0,0,0,0,0,0,0]
[84,0,0,0,0,0,0,0,0,0,0,0,0,0,0,0,0,0,0,0,0,0,0,0,0,0,0,0,0,0,0,0,0,0,0,0,0,0,0,0,0,0,0,0,0,0,0,0,0,0,0,0,0,0,0,0,0,0,0,0,0,0,0,0,0,0,0,0,0,0,0,0,0,0,0,0,0,0,0,0,0,0,0,0,0,0,0,0,0,0,0,0,0,0,0,0,0,0,0,0,0,0,0,0,0,0,0,0,0,0,0,0,0,0,0,0,0,0,0,0,0,0,0,0,0,0,0,0,0,0,0,0]
[85,0,0,0,{"$f":"INDIRECT($C$33&E$32&ROW()-$C$34)","v":0},0,0,0,0,0,0,0,0,0,{"$f":"INDIRECT($C$33&O$32&ROW()-$C$34)","v":0},0,0,0,0,0,0,0,0,0,{"$f":"INDIRECT($C$33&Y$32&ROW()-$C$34)","v":0},0,0,0,0,0,0,0,0,0,{"$f":"INDIRECT($C$33&AI$32&ROW()-$C$34)","v":0},0,0,0,0,0,0,0,0,0,{"$f":"INDIRECT($C$33&AS$32&ROW()-$C$34)","v":0},0,0,0,0,0,0,0,0,0,{"$f":"INDIRECT($C$33&BC$32&ROW()-$C$34)","v":0},0,0,0,0,0,0,0,0,0,{"$f":"INDIRECT($C$33&BM$32&ROW()-$C$34)","v":0},0,0,0,0,0,0,0,0,0,{"$f":"INDIRECT($C$33&BW$32&ROW()-$C$34)","v":0},0,0,0,0,0,0,0,0,0,{"$f":"INDIRECT($C$33&CG$32&ROW()-$C$34)","v":0},0,0,0,0,0,0,0,0,0,{"$f":"INDIRECT($C$33&CQ$32&ROW()-$C$34)","v":0},0,0,0,0,0,0,0,0,0,0,0,0,0,0,0,{"$f":"INDIRECT($C$33&DG$32&ROW()-$C$34)","v":0},0,0,0,0,0,0,0,0,0,0,0,0,{"$f":"INDIRECT($C$33&DT$32&ROW()-$C$34)","v":0},0,0,0,0,0,0,0,0]
[86,0,{"$f":"INDIRECT($C$33&C$32&ROW()-$C$34)","v":0},0,0,0,0,0,0,0,0,0,0,0,0,0,0,0,0,0,0,0,0,0,0,0,0,0,0,0,0,0,0,0,0,0,0,0,0,0,0,0,0,0,0,0,0,0,0,0,0,0,0,0,0,0,0,0,0,0,0,0,0,0,0,0,0,0,0,0,0,0,0,0,0,0,0,0,0,0,0,0,0,0,0,0,0,0,0,0,0,0,0,0,0,0,0,0,0,0,0,0,0,0,0,0,0,0,0,0,0,0,0,0,0,0,0,0,0,0,0,0,0,0,0,0,0,0,0,0,0,0]
[87,0,0,0,0,0,0,0,0,0,0,0,0,0,0,0,0,0,0,0,0,0,0,0,0,0,0,0,0,0,0,0,0,0,0,0,0,0,0,0,0,0,0,0,0,0,0,0,0,0,0,0,0,0,0,0,0,0,0,0,0,0,0,0,0,0,0,0,0,0,0,0,0,0,0,0,0,0,0,0,0,0,0,0,0,0,0,0,0,0,0,0,0,0,0,0,0,0,0,0,0,0,0,0,0,0,0,0,0,0,0,0,0,0,0,0,0,0,0,0,0,0,0,0,0,0,0,0,0,0,0,0]
[88,0,0,0,0,0,0,0,0,0,0,0,0,0,0,0,0,0,0,0,0,0,0,0,0,0,0,0,0,0,0,0,0,0,0,0,0,0,0,0,0,0,0,0,0,0,0,0,0,0,0,0,0,0,0,0,0,0,0,0,0,0,0,0,0,0,0,0,0,0,0,0,0,0,0,0,0,0,0,0,0,0,0,0,0,0,0,0,0,0,0,0,0,0,0,0,0,0,0,0,0,0,0,0,0,0,0,0,0,0,0,0,0,0,0,0,0,0,0,0,0,0,0,0,0,0,0,0,0,0,0,0]
[89,0,0,0,0,0,0,0,0,0,0,0,0,0,0,0,0,0,0,0,0,0,0,0,0,0,0,0,0,0,0,0,0,0,0,0,0,0,0,0,0,0,0,0,0,0,0,0,0,0,0,0,0,0,0,0,0,0,0,0,0,0,0,0,0,0,0,0,0,0,0,0,0,0,0,0,0,0,0,0,0,0,0,0,0,0,0,0,0,0,0,0,0,0,0,0,0,0,0,0,0,0,0,0,0,0,0,0,0,0,0,0,0,0,0,0,0,0,0,0,0,0,0,0,0,0,0,0,0,0,0,0]
[90,0,0,0,0,0,0,0,0,0,0,0,0,0,0,0,0,0,0,0,0,0,0,0,0,0,0,0,0,0,0,0,0,0,0,0,0,0,0,0,0,0,0,0,0,0,0,0,0,0,0,0,0,0,0,0,0,0,0,0,0,0,0,0,0,0,0,0,0,0,0,0,0,0,0,0,0,0,0,0,0,0,0,0,0,0,0,0,0,0,0,0,0,0,0,0,0,0,0,0,0,0,0,0,0,0,0,0,0,0,0,0,0,0,0,0,0,0,0,0,0,0,0,0,0,0,0,0,0,0,0,0]
[91,0,0,0,0,0,0,0,0,0,0,0,0,0,0,0,0,0,0,0,0,0,0,0,0,0,0,0,0,0,0,0,0,0,0,0,0,0,0,0,0,0,0,0,0,0,0,0,0,0,0,0,0,0,0,0,0,0,0,0,0,0,0,0,0,0,0,0,0,0,0,0,0,0,0,0,0,0,0,0,0,0,0,0,0,0,0,0,0,0,0,0,0,0,0,0,0,0,0,0,0,0,0,0,0,0,0,0,0,0,0,0,0,0,0,0,0,0,0,0,0,0,0,0,0,0,0,0,0,0,0,0]
[92,0,0,0,0,0,0,0,0,0,0,0,0,0,0,0,0,0,0,0,0,0,0,0,0,0,0,0,0,0,0,0,0,0,0,0,0,0,0,0,0,0,0,0,0,0,0,0,0,0,0,0,0,0,0,0,0,0,0,0,0,0,0,0,0,0,0,0,0,0,0,0,0,0,0,0,0,0,0,0,0,0,0,0,0,0,0,0,0,0,0,0,0,0,0,0,0,0,0,0,0,0,0,0,0,0,0,0,0,0,0,0,0,0,0,0,0,0,0,0,0,0,0,0,0,0,0,0,0,0,0,0]
[93,0,0,0,0,0,0,0,0,0,0,0,0,0,0,0,0,0,0,0,0,0,0,0,0,0,0,0,0,0,0,0,0,0,0,0,0,0,0,0,0,0,0,0,0,0,0,0,0,0,0,0,0,0,0,0,0,0,0,0,0,0,0,0,0,0,0,0,0,0,0,0,0,0,0,0,0,0,0,0,0,0,0,0,0,0,0,0,0,0,0,0,0,0,0,0,0,0,0,0,0,0,0,0,0,0,0,0,0,0,0,0,0,0,0,0,0,0,0,0,0,0,0,0,0,0,0,0,0,0,0,0]
[94,0,0,0,0,0,0,0,0,0,0,0,0,0,0,0,0,0,0,0,0,0,0,0,0,0,0,0,0,0,0,0,0,0,0,0,0,0,0,0,0,0,0,0,0,0,0,0,0,0,0,0,0,0,0,0,0,0,0,0,0,0,0,0,0,0,0,0,0,0,0,0,0,0,0,0,0,0,0,0,0,0,0,0,0,0,0,0,0,0,0,0,0,0,0,0,0,0,0,0,0,0,0,0,0,0,0,0,0,0,0,0,0,0,0,0,0,0,0,0,0,0,0,0,0,0,0,0,0,0,0,0]
[95,0,0,0,{"$f":"INDIRECT($C$33&E$32&ROW()-$C$34)","v":0},0,0,0,0,0,0,0,0,0,{"$f":"INDIRECT($C$33&O$32&ROW()-$C$34)","v":0},0,0,0,0,0,0,0,0,0,{"$f":"INDIRECT($C$33&Y$32&ROW()-$C$34)","v":0},0,0,0,0,0,0,0,0,0,{"$f":"INDIRECT($C$33&AI$32&ROW()-$C$34)","v":0},0,0,0,0,0,0,0,0,0,{"$f":"INDIRECT($C$33&AS$32&ROW()-$C$34)","v":0},0,0,0,0,0,0,0,0,0,{"$f":"INDIRECT($C$33&BC$32&ROW()-$C$34)","v":0},0,0,0,0,0,0,0,0,0,{"$f":"INDIRECT($C$33&BM$32&ROW()-$C$34)","v":0},0,0,0,0,0,0,0,0,0,{"$f":"INDIRECT($C$33&BW$32&ROW()-$C$34)","v":0},0,0,0,0,0,0,0,0,0,{"$f":"INDIRECT($C$33&CG$32&ROW()-$C$34)","v":0},0,0,0,0,0,0,0,0,0,{"$f":"INDIRECT($C$33&CQ$32&ROW()-$C$34)","v":0},0,0,0,0,0,0,0,0,0,0,0,0,0,0,0,0,0,0,0,0,0,0,0,0,0,0,0,0,0,0,0,0,0,0,0,0,0]
[96,0,0,0,0,0,0,0,0,0,0,0,0,0,0,0,0,0,0,0,0,0,0,0,0,0,0,0,0,0,0,0,0,0,0,0,0,0,0,0,0,0,0,0,0,0,0,0,0,0,0,0,0,0,0,0,0,0,0,0,0,0,0,0,0,0,0,0,0,0,0,0,0,0,0,0,0,0,0,0,0,0,0,0,0,0,0,0,0,0,0,0,0,0,0,0,0,0,0,0,0,0,0,0,0,0,0,0,0,0,0,0,0,0,0,0,0,0,0,0,0,0,0,0,0,0,0,0,0,0,0,0]
[97,0,0,0,0,0,0,0,0,0,0,0,0,0,0,0,0,0,0,0,0,0,0,0,0,0,0,0,0,0,0,0,0,0,0,0,0,0,0,0,0,0,0,0,0,0,0,0,0,0,0,0,0,0,0,0,0,0,0,0,0,0,0,0,0,0,0,0,0,0,0,0,0,0,0,0,0,0,0,0,0,0,0,0,0,0,0,0,0,0,0,0,0,0,0,0,0,0,0,0,0,0,0,0,0,0,0,0,0,0,0,0,0,0,0,0,0,0,0,0,0,0,0,0,0,0,0,0,0,0,0,0]
[98,0,0,0,0,0,0,0,0,0,0,0,0,0,0,0,0,0,0,0,0,0,0,0,0,0,0,0,0,0,0,0,0,0,0,0,0,0,0,0,0,0,0,0,0,0,0,0,0,0,0,0,0,0,0,0,0,0,0,0,0,0,0,0,0,0,0,0,0,0,0,0,0,0,0,0,0,0,0,0,0,0,0,0,0,0,0,0,0,0,0,0,0,0,0,0,0,0,0,0,0,0,0,0,0,0,0,0,0,0,0,0,0,0,0,0,0,0,0,0,0,0,0,0,0,0,0,0,0,0,0,0]
[99,0,0,0,0,0,0,0,0,0,0,0,0,0,0,0,0,0,0,0,0,0,0,0,0,0,0,0,0,0,0,0,0,0,0,0,0,0,0,0,0,0,0,0,0,0,0,0,0,0,0,0,0,0,0,0,0,0,0,0,0,0,0,0,0,0,0,0,0,0,0,0,0,0,0,0,0,0,0,0,0,0,0,0,0,0,0,0,0,0,0,0,0,0,0,0,0,0,0,0,0,0,0,0,0,0,0,0,0,0,0,0,0,0,0,0,0,0,0,0,0,0,0,0,0,0,0,0,0,0,0,0]
[100,0,0,0,0,0,0,0,0,0,0,0,0,0,0,0,0,0,0,0,0,0,0,0,0,0,0,0,0,0,0,0,0,0,0,0,0,0,0,0,0,0,0,0,0,0,0,0,0,0,0,0,0,0,0,0,0,0,0,0,0,0,0,0,0,0,0,0,0,0,0,0,0,0,0,0,0,0,0,0,0,0,0,0,0,0,0,0,0,0,0,0,0,0,0,0,0,0,0,0,0,0,0,0,0,0,0,0,0,0,0,0,0,0,0,0,0,0,0,0,0,0,0,0,0,0,0,0,0,0,0,0]
[101,0,0,0,0,0,0,0,0,0,0,0,0,0,0,0,0,0,0,0,0,0,0,0,0,0,0,0,0,0,0,0,0,0,0,0,0,0,0,0,0,0,0,0,0,0,0,0,0,0,0,0,0,0,0,0,0,0,0,0,0,0,0,0,0,0,0,0,0,0,0,0,0,0,0,0,0,0,0,0,0,0,0,0,0,0,0,0,0,0,0,0,0,0,0,0,0,0,0,0,0,0,0,0,0,0,{"$f":"INDIRECT($C$33&DC$32&ROW()-$C$34)","v":0},0,0,0,0,0,0,0,0,0,0,0,0,0,0,0,0,{"$f":"INDIRECT($C$33&DT$32&ROW()-$C$34)","v":0},0,0,0,0,0,0,0,0]
[102,{"$f":"IF(LEN(C132)>1,A132,0)","v":0},0,0,0,0,0,0,0,0,0,0,0,0,0,0,0,0,0,0,0,0,0,0,0,0,0,0,0,0,0,0,0,0,0,0,0,0,0,0,0,0,0,0,0,0,0,0,0,0,0,0,0,0,0,0,0,0,0,0,0,0,0,0,0,0,0,0,0,0,0,0,0,0,0,0,0,0,0,0,0,0,0,0,0,0,0,0,0,0,0,0,0,0,0,0,0,0,0,0,0,0,0,0,0,0,0,0,0,0,0,0,0,0,0,0,0,0,0,0,0,0,0,0,0,0,0,0,0,0,0,0]
[103,0,0,0,0,0,0,0,0,0,0,0,0,0,0,0,0,0,0,0,0,0,0,0,0,0,0,0,0,0,0,0,0,0,0,0,0,0,0,0,0,0,0,0,0,0,0,0,0,0,0,0,0,0,0,0,0,0,0,0,0,0,0,0,0,0,0,0,0,0,0,0,0,0,0,0,0,0,0,0,0,0,0,0,0,0,0,0,0,0,0,0,0,0,0,0,0,0,0,0,0,0,0,0,0,0,0,0,0,0,0,0,0,0,0,0,0,0,0,0,0,0,0,0,0,0,0,0,0,0,0,0]
[104,0,0,0,0,0,0,0,0,0,0,0,0,0,0,0,0,0,0,0,0,0,0,0,0,0,0,0,0,0,0,0,0,0,0,0,0,0,0,0,0,0,0,0,0,0,0,0,0,0,0,0,0,0,0,0,0,0,0,0,0,0,0,0,0,0,0,0,0,0,0,0,0,0,0,0,0,0,0,0,0,0,0,0,0,0,0,0,0,0,0,0,0,0,0,0,0,0,0,0,0,0,0,0,0,0,0,0,0,0,0,0,0,0,0,0,0,0,0,0,0,0,0,0,0,0,0,0,0,0,0,0]
[105,0,0,0,{"$f":"INDIRECT($C$33&E$32&ROW()-$C$34)","v":0},0,0,0,0,0,0,0,0,0,{"$f":"INDIRECT($C$33&O$32&ROW()-$C$34)","v":0},0,0,0,0,0,0,0,0,0,{"$f":"INDIRECT($C$33&Y$32&ROW()-$C$34)","v":0},0,0,0,0,0,0,0,0,0,{"$f":"INDIRECT($C$33&AI$32&ROW()-$C$34)","v":0},0,0,0,0,0,0,0,0,0,{"$f":"INDIRECT($C$33&AS$32&ROW()-$C$34)","v":0},0,0,0,0,0,0,0,0,0,{"$f":"INDIRECT($C$33&BC$32&ROW()-$C$34)","v":0},0,0,0,0,0,0,0,0,0,{"$f":"INDIRECT($C$33&BM$32&ROW()-$C$34)","v":0},0,0,0,0,0,0,0,0,0,{"$f":"INDIRECT($C$33&BW$32&ROW()-$C$34)","v":0},0,0,0,0,0,0,0,0,0,{"$f":"INDIRECT($C$33&CG$32&ROW()-$C$34)","v":0},0,0,0,0,0,0,0,0,0,{"$f":"INDIRECT($C$33&CQ$32&ROW()-$C$34)","v":0},0,0,0,0,0,0,0,0,0,0,0,0,0,0,0,0,0,0,0,0,0,0,0,0,0,0,0,0,0,0,0,0,0,0,0,0,0]
[106,0,{"$f":"INDIRECT($C$33&C$32&ROW()-$C$34)","v":0},0,0,0,0,0,0,0,0,0,0,0,0,0,0,0,0,0,0,0,0,0,0,0,0,0,0,0,0,0,0,0,0,0,0,0,0,0,0,0,0,0,0,0,0,0,0,0,0,0,0,0,0,0,0,0,0,0,0,0,0,0,0,0,0,0,0,0,0,0,0,0,0,0,0,0,0,0,0,0,0,0,0,0,0,0,0,0,0,0,0,0,0,0,0,0,0,0,0,0,0,0,0,0,0,0,0,0,0,0,0,0,0,0,0,0,0,0,0,0,0,0,0,0,0,0,0,0,0,0]
[107,0,0,0,0,0,0,0,0,0,0,0,0,0,0,0,0,0,0,0,0,0,0,0,0,0,0,0,0,0,0,0,0,0,0,0,0,0,0,0,0,0,0,0,0,0,0,0,0,0,0,0,0,0,0,0,0,0,0,0,0,0,0,0,0,0,0,0,0,0,0,0,0,0,0,0,0,0,0,0,0,0,0,0,0,0,0,0,0,0,0,0,0,0,0,0,0,0,0,0,0,0,0,0,0,0,0,0,0,0,0,0,0,0,0,0,0,0,0,0,0,0,0,0,0,0,0,0,0,0,0,0]
[108,0,0,0,0,0,0,0,0,0,0,0,0,0,0,0,0,0,0,0,0,0,0,0,0,0,0,0,0,0,0,0,0,0,0,0,0,0,0,0,0,0,0,0,0,0,0,0,0,0,0,0,0,0,0,0,0,0,0,0,0,0,0,0,0,0,0,0,0,0,0,0,0,0,0,0,0,0,0,0,0,0,0,0,0,0,0,0,0,0,0,0,0,0,0,0,0,0,0,0,0,0,0,0,0,0,0,0,0,0,0,0,0,0,0,0,0,0,0,0,0,0,0,0,0,0,0,0,0,0,0,0]
[109,0,0,0,0,0,0,0,0,0,0,0,0,0,0,0,0,0,0,0,0,0,0,0,0,0,0,0,0,0,0,0,0,0,0,0,0,0,0,0,0,0,0,0,0,0,0,0,0,0,0,0,0,0,0,0,0,0,0,0,0,0,0,0,0,0,0,0,0,0,0,0,0,0,0,0,0,0,0,0,0,0,0,0,0,0,0,0,0,0,0,0,0,0,0,0,0,0,0,0,0,0,0,0,0,0,0,0,0,0,0,0,0,0,0,0,0,0,0,0,0,0,0,0,0,0,0,0,0,0,0,0]
[110,0,0,0,0,0,0,0,0,0,0,0,0,0,0,0,0,0,0,0,0,0,0,0,0,0,0,0,0,0,0,0,0,0,0,0,0,0,0,0,0,0,0,0,0,0,0,0,0,0,0,0,0,0,0,0,0,0,0,0,0,0,0,0,0,0,0,0,0,0,0,0,0,0,0,0,0,0,0,0,0,0,0,0,0,0,0,0,0,0,0,0,0,0,0,0,0,0,0,0,0,0,0,0,0,0,0,0,0,0,0,0,0,0,0,0,0,0,0,0,0,0,0,0,0,0,0,0,0,0,0,0]
[111,0,0,0,0,0,0,0,0,0,0,0,0,0,0,0,0,0,0,0,0,0,0,0,0,0,0,0,0,0,0,0,0,0,0,0,0,0,0,0,0,0,0,0,0,0,0,0,0,0,0,0,0,0,0,0,0,0,0,0,0,0,0,0,0,0,0,0,0,0,0,0,0,0,0,0,0,0,0,0,0,0,0,0,0,0,0,0,0,0,0,0,0,0,0,0,0,0,0,0,0,0,0,0,0,0,0,0,0,0,0,0,0,0,0,0,0,0,0,0,0,0,0,0,0,0,0,0,0,0,0,0]
[112,0,0,0,0,0,0,0,0,0,0,0,0,0,0,0,0,0,0,0,0,0,0,0,0,0,0,0,0,0,0,0,0,0,0,0,0,0,0,0,0,0,0,0,0,0,0,0,0,0,0,0,0,0,0,0,0,0,0,0,0,0,0,0,0,0,0,0,0,0,0,0,0,0,0,0,0,0,0,0,0,0,0,0,0,0,0,0,0,0,0,0,0,0,0,0,0,0,0,0,0,0,0,0,0,0,0,0,0,0,0,0,0,0,0,0,0,0,0,0,0,0,0,0,0,0,0,0,0,0,0,0]
[113,0,0,0,0,0,0,0,0,0,0,0,0,0,0,0,0,0,0,0,0,0,0,0,0,0,0,0,0,0,0,0,0,0,0,0,0,0,0,0,0,0,0,0,0,0,0,0,0,0,0,0,0,0,0,0,0,0,0,0,0,0,0,0,0,0,0,0,0,0,0,0,0,0,0,0,0,0,0,0,0,0,0,0,0,0,0,0,0,0,0,0,0,0,0,0,0,0,0,0,0,0,0,0,0,0,0,0,0,0,0,0,0,0,0,0,0,0,0,0,0,0,0,0,0,0,0,0,0,0,0,0]
[114,0,0,0,0,0,0,0,0,0,0,0,0,0,0,0,0,0,0,0,0,0,0,0,0,0,0,0,0,0,0,0,0,0,0,0,0,0,0,0,0,0,0,0,0,0,0,0,0,0,0,0,0,0,0,0,0,0,0,0,0,0,0,0,0,0,0,0,0,0,0,0,0,0,0,0,0,0,0,0,0,0,0,0,0,0,0,0,0,0,0,0,0,0,0,0,0,0,0,0,0,0,0,0,0,0,0,0,0,0,0,0,0,0,0,0,0,0,0,0,0,0,0,0,0,0,0,0,0,0,0,0]
[115,0,0,0,{"$f":"INDIRECT($C$33&E$32&ROW()-$C$34)","v":0},0,0,0,0,0,0,0,0,0,{"$f":"INDIRECT($C$33&O$32&ROW()-$C$34)","v":0},0,0,0,0,0,0,0,0,0,{"$f":"INDIRECT($C$33&Y$32&ROW()-$C$34)","v":0},0,0,0,0,0,0,0,0,0,{"$f":"INDIRECT($C$33&AI$32&ROW()-$C$34)","v":0},0,0,0,0,0,0,0,0,0,{"$f":"INDIRECT($C$33&AS$32&ROW()-$C$34)","v":0},0,0,0,0,0,0,0,0,0,{"$f":"INDIRECT($C$33&BC$32&ROW()-$C$34)","v":0},0,0,0,0,0,0,0,0,0,{"$f":"INDIRECT($C$33&BM$32&ROW()-$C$34)","v":0},0,0,0,0,0,0,0,0,0,{"$f":"INDIRECT($C$33&BW$32&ROW()-$C$34)","v":0},0,0,0,0,0,0,0,0,0,{"$f":"INDIRECT($C$33&CG$32&ROW()-$C$34)","v":0},0,0,0,0,0,0,0,0,0,{"$f":"INDIRECT($C$33&CQ$32&ROW()-$C$34)","v":0},0,0,0,0,0,0,0,0,0,0,0,0,0,0,0,0,0,0,0,0,0,0,0,0,0,0,0,0,0,0,0,0,0,0,0,0,0]
[116,0,0,0,0,0,0,0,0,0,0,0,0,0,0,0,0,0,0,0,0,0,0,0,0,0,0,0,0,0,0,0,0,0,0,0,0,0,0,0,0,0,0,0,0,0,0,0,0,0,0,0,0,0,0,0,0,0,0,0,0,0,0,0,0,0,0,0,0,0,0,0,0,0,0,0,0,0,0,0,0,0,0,0,0,0,0,0,0,0,0,0,0,0,0,0,0,0,0,0,0,0,0,0,0,0,0,0,0,0,0,0,0,0,0,0,0,0,0,0,0,0,0,0,0,0,0,0,0,0,0,0]
[117,0,0,0,0,0,0,0,0,0,0,0,0,0,0,0,0,0,0,0,0,0,0,0,0,0,0,0,0,0,0,0,0,0,0,0,0,0,0,0,0,0,0,0,0,0,0,0,0,0,0,0,0,0,0,0,0,0,0,0,0,0,0,0,0,0,0,0,0,0,0,0,0,0,0,0,0,0,0,0,0,0,0,0,0,0,0,0,0,0,0,0,0,0,0,0,0,0,0,0,0,0,0,0,0,0,{"$f":"INDIRECT($C$33&DC$32&ROW()-$C$34)","v":0},0,0,0,0,0,0,0,0,0,0,0,0,0,0,0,0,{"$f":"INDIRECT($C$33&DT$32&ROW()-$C$34)","v":0},0,0,0,0,0,0,0,0]
[118,0,0,0,0,0,0,0,0,0,0,0,0,0,0,0,0,0,0,0,0,0,0,0,0,0,0,0,0,0,0,0,0,0,0,0,0,0,0,0,0,0,0,0,0,0,0,0,0,0,0,0,0,0,0,0,0,0,0,0,0,0,0,0,0,0,0,0,0,0,0,0,0,0,0,0,0,0,0,0,0,0,0,0,0,0,0,0,0,0,0,0,0,0,0,0,0,0,0,0,0,0,0,0,0,0,0,0,0,0,0,0,0,0,0,0,0,0,0,0,0,0,0,0,0,0,0,0,0,0,0,0]
[119,0,0,0,0,0,0,0,0,0,0,0,0,0,0,0,0,0,0,0,0,0,0,0,0,0,0,0,0,0,0,0,0,0,0,0,0,0,0,0,0,0,0,0,0,0,0,0,0,0,0,0,0,0,0,0,0,0,0,0,0,0,0,0,0,0,0,0,0,0,0,0,0,0,0,0,0,0,0,0,0,0,0,0,0,0,0,0,0,0,0,0,0,0,0,0,0,0,0,0,0,0,0,0,0,0,0,0,0,0,0,0,0,0,0,0,0,0,0,0,0,0,0,0,0,0,0,0,0,0,0,0]
[120,0,0,0,0,0,0,0,0,0,0,0,0,0,0,0,0,0,0,0,0,0,0,0,0,0,0,0,0,0,0,0,0,0,0,0,0,0,0,0,0,0,0,0,0,0,0,0,0,0,0,0,0,0,0,0,0,0,0,0,0,0,0,0,0,0,0,0,0,0,0,0,0,0,0,0,0,0,0,0,0,0,0,0,0,0,0,0,0,0,0,0,0,0,0,0,0,0,0,0,0,0,0,0,0,0,0,0,0,0,0,0,0,0,0,0,0,0,0,0,0,0,0,0,0,0,0,0,0,0,0,0]
[121,0,0,0,0,0,0,0,0,0,0,0,0,0,0,0,0,0,0,0,0,0,0,0,0,0,0,0,0,0,0,0,0,0,0,0,0,0,0,0,0,0,0,0,0,0,0,0,0,0,0,0,0,0,0,0,0,0,0,0,0,0,0,0,0,0,0,0,0,0,0,0,0,0,0,0,0,0,0,0,0,0,0,0,0,0,0,0,0,0,0,0,0,0,0,0,0,0,0,0,0,0,0,0,0,0,0,0,0,0,0,0,0,0,0,0,0,0,0,0,0,0,0,0,0,0,0,0,0,0,0,0]
[122,0,0,0,0,0,0,0,0,0,0,0,0,0,0,0,0,0,0,0,0,0,0,0,0,0,0,0,0,0,0,0,0,0,0,0,0,0,0,0,0,0,0,0,0,0,0,0,0,0,0,0,0,0,0,0,0,0,0,0,0,0,0,0,0,0,0,0,0,0,0,0,0,0,0,0,0,0,0,0,0,0,0,0,0,0,0,0,0,0,0,0,0,0,0,0,0,0,0,0,0,0,0,0,0,0,0,0,0,0,0,0,0,0,0,0,0,0,0,0,0,0,0,0,0,0,0,0,0,0,0,0]
[123,0,0,0,0,0,0,0,0,0,0,0,0,0,0,0,0,0,0,0,0,0,0,0,0,0,0,0,0,0,0,0,0,0,0,0,0,0,0,0,0,0,0,0,0,0,0,0,0,0,0,0,0,0,0,0,0,0,0,0,0,0,0,0,0,0,0,0,0,0,0,0,0,0,0,0,0,0,0,0,0,0,0,0,0,0,0,0,0,0,0,0,0,0,0,0,0,0,0,0,0,0,0,0,0,0,0,0,0,0,0,0,0,0,0,0,0,0,0,0,0,0,0,0,0,0,0,0,0,0,0,0]
[124,0,0,0,0,0,0,0,0,0,0,0,0,0,0,0,0,0,0,0,0,0,0,0,0,0,0,0,0,0,0,0,0,0,0,0,0,0,0,0,0,0,0,0,0,0,0,0,0,0,0,0,0,0,0,0,0,0,0,0,0,0,0,0,0,0,0,0,0,0,0,0,0,0,0,0,0,0,0,0,0,0,0,0,0,0,0,0,0,0,0,0,0,0,0,0,0,0,0,0,0,0,0,0,0,0,0,0,0,0,0,0,0,0,0,0,0,0,0,0,0,0,0,0,0,0,0,0,0,0,0,0]
[125,0,0,0,{"$f":"INDIRECT($C$33&E$32&ROW()-$C$34)","v":0},0,0,0,0,0,0,0,0,0,{"$f":"INDIRECT($C$33&O$32&ROW()-$C$34)","v":0},0,0,0,0,0,0,0,0,0,{"$f":"INDIRECT($C$33&Y$32&ROW()-$C$34)","v":0},0,0,0,0,0,0,0,0,0,{"$f":"INDIRECT($C$33&AI$32&ROW()-$C$34)","v":0},0,0,0,0,0,0,0,0,0,{"$f":"INDIRECT($C$33&AS$32&ROW()-$C$34)","v":0},0,0,0,0,0,0,0,0,0,{"$f":"INDIRECT($C$33&BC$32&ROW()-$C$34)","v":0},0,0,0,0,0,0,0,0,0,{"$f":"INDIRECT($C$33&BM$32&ROW()-$C$34)","v":0},0,0,0,0,0,0,0,0,0,{"$f":"INDIRECT($C$33&BW$32&ROW()-$C$34)","v":0},0,0,0,0,0,0,0,0,0,{"$f":"INDIRECT($C$33&CG$32&ROW()-$C$34)","v":0},0,0,0,0,0,0,0,0,0,{"$f":"INDIRECT($C$33&CQ$32&ROW()-$C$34)","v":0},0,0,0,0,0,0,0,0,0,0,0,0,0,0,0,0,0,0,0,0,0,0,0,0,0,0,0,0,0,0,0,0,0,0,0,0,0]
[126,0,{"$f":"INDIRECT($C$33&C$32&ROW()-$C$34)","v":0},0,0,0,0,0,0,0,0,0,0,0,0,0,0,0,0,0,0,0,0,0,0,0,0,0,0,0,0,0,0,0,0,0,0,0,0,0,0,0,0,0,0,0,0,0,0,0,0,0,0,0,0,0,0,0,0,0,0,0,0,0,0,0,0,0,0,0,0,0,0,0,0,0,0,0,0,0,0,0,0,0,0,0,0,0,0,0,0,0,0,0,0,0,0,0,0,0,0,0,0,0,0,0,0,0,0,0,0,0,0,0,0,0,0,0,0,0,0,0,0,0,0,0,0,0,0,0,0,0]
[127,0,0,0,0,0,0,0,0,0,0,0,0,0,0,0,0,0,0,0,0,0,0,0,0,0,0,0,0,0,0,0,0,0,0,0,0,0,0,0,0,0,0,0,0,0,0,0,0,0,0,0,0,0,0,0,0,0,0,0,0,0,0,0,0,0,0,0,0,0,0,0,0,0,0,0,0,0,0,0,0,0,0,0,0,0,0,0,0,0,0,0,0,0,0,0,0,0,0,0,0,0,0,0,0,0,0,0,0,0,0,0,0,0,0,0,0,0,0,0,0,0,0,0,0,0,0,0,0,0,0,0]
[128,0,0,0,0,0,0,0,0,0,0,0,0,0,0,0,0,0,0,0,0,0,0,0,0,0,0,0,0,0,0,0,0,0,0,0,0,0,0,0,0,0,0,0,0,0,0,0,0,0,0,0,0,0,0,0,0,0,0,0,0,0,0,0,0,0,0,0,0,0,0,0,0,0,0,0,0,0,0,0,0,0,0,0,0,0,0,0,0,0,0,0,0,0,0,0,0,0,0,0,0,0,0,0,0,0,0,0,0,0,0,0,0,0,0,0,0,0,0,0,0,0,0,0,0,0,0,0,0,0,0,0]
[129,0,0,0,0,0,0,0,0,0,0,0,0,0,0,0,0,0,0,0,0,0,0,0,0,0,0,0,0,0,0,0,0,0,0,0,0,0,0,0,0,0,0,0,0,0,0,0,0,0,0,0,0,0,0,0,0,0,0,0,0,0,0,0,0,0,0,0,0,0,0,0,0,0,0,0,0,0,0,0,0,0,0,0,0,0,0,0,0,0,0,0,0,0,0,0,0,0,0,0,0,0,0,0,0,0,0,0,0,0,0,0,0,0,0,0,0,0,0,0,0,0,0,0,0,0,0,0,0,0,0,0]
[130,0,0,0,0,0,0,0,0,0,0,0,0,0,0,0,0,0,0,0,0,0,0,0,0,0,0,0,0,0,0,0,0,0,0,0,0,0,0,0,0,0,0,0,0,0,0,0,0,0,0,0,0,0,0,0,0,0,0,0,0,0,0,0,0,0,0,0,0,0,0,0,0,0,0,0,0,0,0,0,0,0,0,0,0,0,0,0,0,0,0,0,0,0,0,0,0,0,0,0,0,0,0,0,0,0,0,0,0,0,0,0,0,0,0,0,0,0,0,0,0,0,0,0,0,0,0,0,0,0,0,0]
[{"$f":"A160+1","v":131},0,0,0,0,0,0,0,0,0,0,0,0,0,0,0,0,0,0,0,0,0,0,0,0,0,0,0,0,0,0,0,0,0,0,0,0,0,0,0,0,0,0,0,0,0,0,0,0,0,0,0,0,0,0,0,0,0,0,0,0,0,0,0,0,0,0,0,0,0,0,0,0,0,0,0,0,0,0,0,0,0,0,0,0,0,0,0,0,0,0,0,0,0,0,0,0,0,0,0,0,0,0,0,0,0,0,0,0,0,0,0,0,0,0,0,0,0,0,0,0,0,0,0,0,0,0,0,0,0,0,0]
[132,0,0,0,0,0,0,0,0,0,0,0,0,0,0,0,0,0,0,0,0,0,0,0,0,0,0,0,0,0,0,0,0,0,0,0,0,0,0,0,0,0,0,0,0,0,0,0,0,0,0,0,0,0,0,0,0,0,0,0,0,0,0,0,0,0,0,0,0,0,0,0,0,0,0,0,0,0,0,0,0,0,0,0,0,0,0,0,0,0,0,0,0,0,0,0,0,0,0,0,0,0,0,0,0,0,0,0,0,0,0,0,0,0,0,0,0,0,0,0,0,0,0,0,0,0,0,0,0,0,0,0]
[133,0,0,0,0,0,0,0,0,0,0,0,0,0,0,0,0,0,0,0,0,0,0,0,0,0,0,0,0,0,0,0,0,0,0,0,0,0,0,0,0,0,0,0,0,0,0,0,0,0,0,0,0,0,0,0,0,0,0,0,0,0,0,0,0,0,0,0,0,0,0,0,0,0,0,0,0,0,0,0,0,0,0,0,0,0,0,0,0,0,0,0,0,0,0,0,0,0,0,0,0,0,0,0,0,0,{"$f":"INDIRECT($C$33&DC$32&ROW()-$C$34)","v":0},0,0,0,0,0,0,0,0,0,0,0,0,0,0,0,0,{"$f":"INDIRECT($C$33&DT$32&ROW()-$C$34)","v":0},0,0,0,0,0,0,0,0]
[134,{"$f":"IF(LEN(C164)>1,A164,0)","v":0},0,0,0,0,0,0,0,0,0,0,0,0,0,0,0,0,0,0,0,0,0,0,0,0,0,0,0,0,0,0,0,0,0,0,0,0,0,0,0,0,0,0,0,0,0,0,0,0,0,0,0,0,0,0,0,0,0,0,0,0,0,0,0,0,0,0,0,0,0,0,0,0,0,0,0,0,0,0,0,0,0,0,0,0,0,0,0,0,0,0,0,0,0,0,0,0,0,0,0,0,0,0,0,0,0,0,0,0,0,0,0,0,0,0,0,0,0,0,0,0,0,0,0,0,0,0,0,0,0,0]
[135,0,0,0,{"$f":"INDIRECT($C$33&E$32&ROW()-$C$34)","v":0},0,0,0,0,0,0,0,0,0,{"$f":"INDIRECT($C$33&O$32&ROW()-$C$34)","v":0},0,0,0,0,0,0,0,0,0,{"$f":"INDIRECT($C$33&Y$32&ROW()-$C$34)","v":0},0,0,0,0,0,0,0,0,0,{"$f":"INDIRECT($C$33&AI$32&ROW()-$C$34)","v":0},0,0,0,0,0,0,0,0,0,{"$f":"INDIRECT($C$33&AS$32&ROW()-$C$34)","v":0},0,0,0,0,0,0,0,0,0,{"$f":"INDIRECT($C$33&BC$32&ROW()-$C$34)","v":0},0,0,0,0,0,0,0,0,0,{"$f":"INDIRECT($C$33&BM$32&ROW()-$C$34)","v":0},0,0,0,0,0,0,0,0,0,{"$f":"INDIRECT($C$33&BW$32&ROW()-$C$34)","v":0},0,0,0,0,0,0,0,0,0,{"$f":"INDIRECT($C$33&CG$32&ROW()-$C$34)","v":0},0,0,0,0,0,0,0,0,0,{"$f":"INDIRECT($C$33&CQ$32&ROW()-$C$34)","v":0},0,0,0,0,0,0,0,0,0,0,0,0,0,0,0,0,0,0,0,0,0,0,0,0,0,0,0,0,0,0,0,0,0,0,0,0,0]
[136,0,0,0,0,0,0,0,0,0,0,0,0,0,0,0,0,0,0,0,0,0,0,0,0,0,0,0,0,0,0,0,0,0,0,0,0,0,0,0,0,0,0,0,0,0,0,0,0,0,0,0,0,0,0,0,0,0,0,0,0,0,0,0,0,0,0,0,0,0,0,0,0,0,0,0,0,0,0,0,0,0,0,0,0,0,0,0,0,0,0,0,0,0,0,0,0,0,0,0,0,0,0,0,0,0,0,0,0,0,0,0,0,0,0,0,0,0,0,0,0,0,0,0,0,0,0,0,0,0,0,0]
[137,0,0,0,0,0,0,0,0,0,0,0,0,0,0,0,0,0,0,0,0,0,0,0,0,0,0,0,0,0,0,0,0,0,0,0,0,0,0,0,0,0,0,0,0,0,0,0,0,0,0,0,0,0,0,0,0,0,0,0,0,0,0,0,0,0,0,0,0,0,0,0,0,0,0,0,0,0,0,0,0,0,0,0,0,0,0,0,0,0,0,0,0,0,0,0,0,0,0,0,0,0,0,0,0,0,0,0,0,0,0,0,0,0,0,0,0,0,0,0,0,0,0,0,0,0,0,0,0,0,0,0]
[138,0,0,0,0,0,0,0,0,0,0,0,0,0,0,0,0,0,0,0,0,0,0,0,0,0,0,0,0,0,0,0,0,0,0,0,0,0,0,0,0,0,0,0,0,0,0,0,0,0,0,0,0,0,0,0,0,0,0,0,0,0,0,0,0,0,0,0,0,0,0,0,0,0,0,0,0,0,0,0,0,0,0,0,0,0,0,0,0,0,0,0,0,0,0,0,0,0,0,0,0,0,0,0,0,0,0,0,0,0,0,0,0,0,0,0,0,0,0,0,0,0,0,0,0,0,0,0,0,0,0,0]
[139,0,0,0,0,0,0,0,0,0,0,0,0,0,0,0,0,0,0,0,0,0,0,0,0,0,0,0,0,0,0,0,0,0,0,0,0,0,0,0,0,0,0,0,0,0,0,0,0,0,0,0,0,0,0,0,0,0,0,0,0,0,0,0,0,0,0,0,0,0,0,0,0,0,0,0,0,0,0,0,0,0,0,0,0,0,0,0,0,0,0,0,0,0,0,0,0,0,0,0,0,0,0,0,0,0,0,0,0,0,0,0,0,0,0,0,0,0,0,0,0,0,0,0,0,0,0,0,0,0,0,0]
[140,0,0,0,0,0,0,0,0,0,0,0,0,0,0,0,0,0,0,0,0,0,0,0,0,0,0,0,0,0,0,0,0,0,0,0,0,0,0,0,0,0,0,0,0,0,0,0,0,0,0,0,0,0,0,0,0,0,0,0,0,0,0,0,0,0,0,0,0,0,0,0,0,0,0,0,0,0,0,0,0,0,0,0,0,0,0,0,0,0,0,0,0,0,0,0,0,0,0,0,0,0,0,0,0,0,0,0,0,0,0,0,0,0,0,0,0,0,0,0,0,0,0,0,0,0,0,0,0,0,0,0]
[141,0,0,0,0,0,0,0,0,0,0,0,0,0,0,0,0,0,0,0,0,0,0,0,0,0,0,0,0,0,0,0,0,0,0,0,0,0,0,0,0,0,0,0,0,0,0,0,0,0,0,0,0,0,0,0,0,0,0,0,0,0,0,0,0,0,0,0,0,0,0,0,0,0,0,0,0,0,0,0,0,0,0,0,0,0,0,0,0,0,0,0,0,0,0,0,0,0,0,0,0,0,0,0,0,0,0,0,0,0,0,0,0,0,0,0,0,0,0,0,0,0,0,0,0,0,0,0,0,0,0,0]
[142,0,0,0,0,0,0,0,0,0,0,0,0,0,0,0,0,0,0,0,0,0,0,0,0,0,0,0,0,0,0,0,0,0,0,0,0,0,0,0,0,0,0,0,0,0,0,0,0,0,0,0,0,0,0,0,0,0,0,0,0,0,0,0,0,0,0,0,0,0,0,0,0,0,0,0,0,0,0,0,0,0,0,0,0,0,0,0,0,0,0,0,0,0,0,0,0,0,0,0,0,0,0,0,0,0,0,0,0,0,0,0,0,0,0,0,0,0,0,0,0,0,0,0,0,0,0,0,0,0,0,0]
[143,0,0,0,0,0,0,0,0,0,0,0,0,0,0,0,0,0,0,0,0,0,0,0,0,0,0,0,0,0,0,0,0,0,0,0,0,0,0,0,0,0,0,0,0,0,0,0,0,0,0,0,0,0,0,0,0,0,0,0,0,0,0,0,0,0,0,0,0,0,0,0,0,0,0,0,0,0,0,0,0,0,0,0,0,0,0,0,0,0,0,0,0,0,0,0,0,0,0,0,0,0,0,0,0,0,0,0,0,0,0,0,0,0,0,0,0,0,0,0,0,0,0,0,0,0,0,0,0,0,0,0]
[144,0,0,0,0,0,0,0,0,0,0,0,0,0,0,0,0,0,0,0,0,0,0,0,0,0,0,0,0,0,0,0,0,0,0,0,0,0,0,0,0,0,0,0,0,0,0,0,0,0,0,0,0,0,0,0,0,0,0,0,0,0,0,0,0,0,0,0,0,0,0,0,0,0,0,0,0,0,0,0,0,0,0,0,0,0,0,0,0,0,0,0,0,0,0,0,0,0,0,0,0,0,0,0,0,0,0,0,0,0,0,0,0,0,0,0,0,0,0,0,0,0,0,0,0,0,0,0,0,0,0,0]
[145,0,0,0,{"$f":"INDIRECT($C$33&E$32&ROW()-$C$34)","v":0},0,0,0,0,0,0,0,0,0,{"$f":"INDIRECT($C$33&O$32&ROW()-$C$34)","v":0},0,0,0,0,0,0,0,0,0,{"$f":"INDIRECT($C$33&Y$32&ROW()-$C$34)","v":0},0,0,0,0,0,0,0,0,0,{"$f":"INDIRECT($C$33&AI$32&ROW()-$C$34)","v":0},0,0,0,0,0,0,0,0,0,{"$f":"INDIRECT($C$33&AS$32&ROW()-$C$34)","v":0},0,0,0,0,0,0,0,0,0,{"$f":"INDIRECT($C$33&BC$32&ROW()-$C$34)","v":0},0,0,0,0,0,0,0,0,0,{"$f":"INDIRECT($C$33&BM$32&ROW()-$C$34)","v":0},0,0,0,0,0,0,0,0,0,{"$f":"INDIRECT($C$33&BW$32&ROW()-$C$34)","v":0},0,0,0,0,0,0,0,0,0,{"$f":"INDIRECT($C$33&CG$32&ROW()-$C$34)","v":0},0,0,0,0,0,0,0,0,0,{"$f":"INDIRECT($C$33&CQ$32&ROW()-$C$34)","v":0},0,0,0,0,0,0,0,0,0,0,0,0,0,0,0,0,0,0,0,0,0,0,0,0,0,0,0,0,0,0,0,0,0,0,0,0,0]
[146,0,{"$f":"INDIRECT($C$33&C$32&ROW()-$C$34)","v":0},0,0,0,0,0,0,0,0,0,0,0,0,0,0,0,0,0,0,0,0,0,0,0,0,0,0,0,0,0,0,0,0,0,0,0,0,0,0,0,0,0,0,0,0,0,0,0,0,0,0,0,0,0,0,0,0,0,0,0,0,0,0,0,0,0,0,0,0,0,0,0,0,0,0,0,0,0,0,0,0,0,0,0,0,0,0,0,0,0,0,0,0,0,0,0,0,0,0,0,0,0,0,0,0,0,0,0,0,0,0,0,0,0,0,0,0,0,0,0,0,0,0,0,0,0,0,0,0,0]
[147,0,0,0,0,0,0,0,0,0,0,0,0,0,0,0,0,0,0,0,0,0,0,0,0,0,0,0,0,0,0,0,0,0,0,0,0,0,0,0,0,0,0,0,0,0,0,0,0,0,0,0,0,0,0,0,0,0,0,0,0,0,0,0,0,0,0,0,0,0,0,0,0,0,0,0,0,0,0,0,0,0,0,0,0,0,0,0,0,0,0,0,0,0,0,0,0,0,0,0,0,0,0,0,0,0,0,0,0,0,0,0,0,0,0,0,0,0,0,0,0,0,0,0,0,0,0,0,0,0,0,0]
[148,0,0,0,0,0,0,0,0,0,0,0,0,0,0,0,0,0,0,0,0,0,0,0,0,0,0,0,0,0,0,0,0,0,0,0,0,0,0,0,0,0,0,0,0,0,0,0,0,0,0,0,0,0,0,0,0,0,0,0,0,0,0,0,0,0,0,0,0,0,0,0,0,0,0,0,0,0,0,0,0,0,0,0,0,0,0,0,0,0,0,0,0,0,0,0,0,0,0,0,0,0,0,0,0,0,0,0,0,0,0,0,0,0,0,0,0,0,0,0,0,0,0,0,0,0,0,0,0,0,0,0]
[149,0,0,0,0,0,0,0,0,0,0,0,0,0,0,0,0,0,0,0,0,0,0,0,0,0,0,0,0,0,0,0,0,0,0,0,0,0,0,0,0,0,0,0,0,0,0,0,0,0,0,0,0,0,0,0,0,0,0,0,0,0,0,0,0,0,0,0,0,0,0,0,0,0,0,0,0,0,0,0,0,0,0,0,0,0,0,0,0,0,0,0,0,0,0,0,0,0,0,0,0,0,0,0,0,0,{"$f":"INDIRECT($C$33&DC$32&ROW()-$C$34)","v":0},0,0,0,0,0,0,0,0,0,0,0,0,0,0,0,0,{"$f":"INDIRECT($C$33&DT$32&ROW()-$C$34)","v":0},0,0,0,0,0,0,0,0]
[150,0,0,0,0,0,0,0,0,0,0,0,0,0,0,0,0,0,0,0,0,0,0,0,0,0,0,0,0,0,0,0,0,0,0,0,0,0,0,0,0,0,0,0,0,0,0,0,0,0,0,0,0,0,0,0,0,0,0,0,0,0,0,0,0,0,0,0,0,0,0,0,0,0,0,0,0,0,0,0,0,0,0,0,0,0,0,0,0,0,0,0,0,0,0,0,0,0,0,0,0,0,0,0,0,0,0,0,0,0,0,0,0,0,0,0,0,0,0,0,0,0,0,0,0,0,0,0,0,0,0,0]
[151,0,0,0,0,0,0,0,0,0,0,0,0,0,0,0,0,0,0,0,0,0,0,0,0,0,0,0,0,0,0,0,0,0,0,0,0,0,0,0,0,0,0,0,0,0,0,0,0,0,0,0,0,0,0,0,0,0,0,0,0,0,0,0,0,0,0,0,0,0,0,0,0,0,0,0,0,0,0,0,0,0,0,0,0,0,0,0,0,0,0,0,0,0,0,0,0,0,0,0,0,0,0,0,0,0,0,0,0,0,0,0,0,0,0,0,0,0,0,0,0,0,0,0,0,0,0,0,0,0,0,0]
[152,0,0,0,0,0,0,0,0,0,0,0,0,0,0,0,0,0,0,0,0,0,0,0,0,0,0,0,0,0,0,0,0,0,0,0,0,0,0,0,0,0,0,0,0,0,0,0,0,0,0,0,0,0,0,0,0,0,0,0,0,0,0,0,0,0,0,0,0,0,0,0,0,0,0,0,0,0,0,0,0,0,0,0,0,0,0,0,0,0,0,0,0,0,0,0,0,0,0,0,0,0,0,0,0,0,0,0,0,0,0,0,0,0,0,0,0,0,0,0,0,0,0,0,0,0,0,0,0,0,0,0]
[153,0,0,0,0,0,0,0,0,0,0,0,0,0,0,0,0,0,0,0,0,0,0,0,0,0,0,0,0,0,0,0,0,0,0,0,0,0,0,0,0,0,0,0,0,0,0,0,0,0,0,0,0,0,0,0,0,0,0,0,0,0,0,0,0,0,0,0,0,0,0,0,0,0,0,0,0,0,0,0,0,0,0,0,0,0,0,0,0,0,0,0,0,0,0,0,0,0,0,0,0,0,0,0,0,0,0,0,0,0,0,0,0,0,0,0,0,0,0,0,0,0,0,0,0,0,0,0,0,0,0,0]
[154,0,0,0,0,0,0,0,0,0,0,0,0,0,0,0,0,0,0,0,0,0,0,0,0,0,0,0,0,0,0,0,0,0,0,0,0,0,0,0,0,0,0,0,0,0,0,0,0,0,0,0,0,0,0,0,0,0,0,0,0,0,0,0,0,0,0,0,0,0,0,0,0,0,0,0,0,0,0,0,0,0,0,0,0,0,0,0,0,0,0,0,0,0,0,0,0,0,0,0,0,0,0,0,0,0,0,0,0,0,0,0,0,0,0,0,0,0,0,0,0,0,0,0,0,0,0,0,0,0,0,0]
[155,0,0,0,0,0,0,0,0,0,0,0,0,0,0,0,0,0,0,0,0,0,0,0,0,0,0,0,0,0,0,0,0,0,0,0,0,0,0,0,0,0,0,0,0,0,0,0,0,0,0,0,0,0,0,0,0,0,0,0,0,0,0,0,0,0,0,0,0,0,0,0,0,0,0,0,0,0,0,0,0,0,0,0,0,0,0,0,0,0,0,0,0,0,0,0,0,0,0,0,0,0,0,0,0,0,0,0,0,0,0,0,0,0,0,0,0,0,0,0,0,0,0,0,0,0,0,0,0,0,0,0]
[156,{"$f":"IF(LEN(C186)>1,A186,0)","v":0},0,0,0,0,0,0,0,0,0,0,0,0,0,0,0,0,0,0,0,0,0,0,0,0,0,0,0,0,0,0,0,0,0,0,0,0,0,0,0,0,0,0,0,0,0,0,0,0,0,0,0,0,0,0,0,0,0,0,0,0,0,0,0,0,0,0,0,0,0,0,0,0,0,0,0,0,0,0,0,0,0,0,0,0,0,0,0,0,0,0,0,0,0,0,0,0,0,0,0,0,0,0,0,0,0,0,0,0,0,0,0,0,0,0,0,0,0,0,0,0,0,0,0,0,0,0,0,0,0,0]
[157,0,0,0,0,0,0,0,0,0,0,0,0,0,0,0,0,0,0,0,0,0,0,0,0,0,0,0,0,0,0,0,0,0,0,0,0,0,0,0,0,0,0,0,0,0,0,0,0,0,0,0,0,0,0,0,0,0,0,0,0,0,0,0,0,0,0,0,0,0,0,0,0,0,0,0,0,0,0,0,0,0,0,0,0,0,0,0,0,0,0,0,0,0,0,0,0,0,0,0,0,0,0,0,0,0,0,0,0,0,0,0,0,0,0,0,0,0,0,0,0,0,0,0,0,0,0,0,0,0,0,0]
[158,0,0,0,0,0,0,0,0,0,0,0,0,0,0,0,0,0,0,0,0,0,0,0,0,0,0,0,0,0,0,0,0,0,0,0,0,0,0,0,0,0,0,0,0,0,0,0,0,0,0,0,0,0,0,0,0,0,0,0,0,0,0,0,0,0,0,0,0,0,0,0,0,0,0,0,0,0,0,0,0,0,0,0,0,0,0,0,0,0,0,0,0,0,0,0,0,0,0,0,0,0,0,0,0,0,0,0,0,0,0,0,0,0,0,0,0,0,0,0,0,0,0,0,0,0,0,0,0,0,0,0]
[159,0,0,0,0,0,0,0,0,0,0,0,0,0,0,0,0,0,0,0,0,0,0,0,0,0,0,0,0,0,0,0,0,0,0,0,0,0,0,0,0,0,0,0,0,0,0,0,0,0,0,0,0,0,0,0,0,0,0,0,0,0,0,0,0,0,0,0,0,0,0,0,0,0,0,0,0,0,0,0,0,0,0,0,0,0,0,0,0,0,0,0,0,0,0,0,0,0,0,0,0,0,0,0,0,0,0,0,0,0,0,0,0,0,0,0,0,0,0,0,0,0,0,0,0,0,0,0,0,0,0,0]
[160,0,0,0,0,0,0,0,0,0,0,0,0,0,0,0,0,0,0,0,0,0,0,0,0,0,0,0,0,0,0,0,0,0,0,0,0,0,0,0,0,0,0,0,0,0,0,0,0,0,0,0,0,0,0,0,0,0,0,0,0,0,0,0,0,0,0,0,0,0,0,0,0,0,0,0,0,0,0,0,0,0,0,0,0,0,0,0,0,0,0,0,0,0,0,0,0,0,0,0,0,0,0,0,0,0,0,0,0,0,0,0,0,0,0,0,0,0,0,0,0,0,0,0,0,0,0,0,0,0,0,0]
[161,0,0,0,0,0,0,0,0,0,0,0,0,0,0,0,0,0,{"$f":"INDIRECT($C$33&S$32&ROW()-$C$34)","v":0},0,0,0,0,0,0,0,0,0,0,0,0,0,0,0,{"$f":"INDIRECT($C$33&AI$32&ROW()-$C$34)","v":0},0,0,0,0,0,0,0,0,0,0,0,0,0,0,0,{"$f":"INDIRECT($C$33&AY$32&ROW()-$C$34)","v":0},0,0,0,0,0,0,0,0,0,0,0,0,0,0,0,{"$f":"INDIRECT($C$33&BO$32&ROW()-$C$34)","v":0},0,0,0,0,0,0,0,0,0,0,0,0,0,0,0,{"$f":"INDIRECT($C$33&CE$32&ROW()-$C$34)","v":0},0,0,0,0,0,0,0,0,0,0,0,0,0,0,0,{"$f":"INDIRECT($C$33&CU$32&ROW()-$C$34)","v":0},0,0,0,0,0,0,0,0,0,0,0,0,0,0,0,0,0,0,0,0,0,0,0,0,0,0,0,0,0,0,0,0,0]
[162,0,{"$f":"INDIRECT($C$33&C$32&ROW()-$C$34)","v":0},0,0,0,0,0,0,0,0,0,0,0,0,0,0,0,0,0,0,0,0,0,0,0,0,0,0,0,0,0,0,0,0,0,0,0,0,0,0,0,0,0,0,0,0,0,0,0,0,0,0,0,0,0,0,0,0,0,0,0,0,0,0,0,0,0,0,0,0,0,0,0,0,0,0,0,0,0,0,0,0,0,0,0,0,0,0,0,0,0,0,0,0,0,0,0,0,0,0,0,0,0,0,0,0,0,0,0,0,0,0,0,0,0,0,0,0,0,0,0,0,0,0,0,0,0,0,0,0,0]
[163,0,0,0,0,0,0,0,0,0,0,0,0,0,0,0,0,0,0,0,0,0,0,0,0,0,0,0,0,0,0,0,0,0,0,0,0,0,0,0,0,0,0,0,0,0,0,0,0,0,0,0,0,0,0,0,0,0,0,0,0,0,0,0,0,0,0,0,0,0,0,0,0,0,0,0,0,0,0,0,0,0,0,0,0,0,0,0,0,0,0,0,0,0,0,0,0,0,0,0,0,0,0,0,0,0,0,0,0,0,0,0,0,0,0,0,0,0,0,0,0,0,0,0,0,0,0,0,0,0,0,0]
[164,0,0,0,0,0,0,0,0,0,0,0,0,0,0,0,0,0,0,0,0,0,0,0,0,0,0,0,0,0,0,0,0,0,0,0,0,0,0,0,0,0,0,0,0,0,0,0,0,0,0,0,0,0,0,0,0,0,0,0,0,0,0,0,0,0,0,0,0,0,0,0,0,0,0,0,0,0,0,0,0,0,0,0,0,0,0,0,0,0,0,0,0,0,0,0,0,0,0,0,0,0,0,0,0,0,0,0,0,0,0,0,0,0,0,0,0,0,0,0,{"$f":"INDIRECT($C$33&DQ$32&ROW()-$C$34)","v":0},0,0,0,0,0,0,0,0,0,0,0]
[165,0,0,0,0,0,0,0,0,0,0,0,0,0,0,0,0,0,0,0,0,0,0,0,0,0,0,0,0,0,0,0,0,0,0,0,0,0,0,0,0,0,0,0,0,0,0,0,0,0,0,0,0,0,0,0,0,0,0,0,0,0,0,0,0,0,0,0,0,0,0,0,0,0,0,0,0,0,0,0,0,0,0,0,0,0,0,0,0,0,0,0,0,0,0,0,0,0,0,0,0,0,0,0,0,0,0,0,0,0,0,0,0,0,0,0,0,0,0,0,0,0,{"$f":"INDIRECT($C$33&DS$32&ROW()-$C$34)","v":0},0,0,0,0,0,0,0,0,0]
[166,0,0,0,0,0,0,0,0,0,0,0,0,0,0,0,0,0,0,0,0,0,0,0,0,0,0,0,0,0,0,0,0,0,0,0,0,0,0,0,0,0,0,0,0,0,0,0,0,0,0,0,0,0,0,0,0,0,0,0,0,0,0,0,0,0,0,0,0,0,0,0,0,0,0,0,0,0,0,0,0,0,0,0,0,0,0,0,0,0,0,0,0,0,0,0,0,0,0,0,0,0,0,0,0,0,0,0,0,0,0,0,0,0,0,0,0,0,0,0,0,0,0,0,0,0,0,0,0,0,0,0]
[167,0,0,0,0,0,0,0,0,0,0,0,0,0,0,0,0,0,0,0,0,0,0,0,0,0,0,0,0,0,0,0,0,0,0,0,0,0,0,0,0,0,0,0,0,0,0,0,0,0,0,0,0,0,0,0,0,0,0,0,0,0,0,0,0,0,0,0,0,0,0,0,0,0,0,0,0,0,0,0,0,0,0,0,0,0,0,0,0,0,0,0,0,0,0,0,0,0,0,0,0,0,0,0,0,0,0,0,0,0,0,0,0,0,0,0,0,0,0,0,0,0,0,0,0,0,0,0,0,0,0,0]
[168,0,0,0,0,0,0,0,0,0,0,0,0,0,0,0,0,0,0,0,0,0,0,0,0,0,0,0,0,0,0,0,0,0,0,0,0,0,0,0,0,0,0,0,0,0,0,0,0,0,0,0,0,0,0,0,0,0,0,0,0,0,0,0,0,0,0,0,0,0,0,0,0,0,0,0,0,0,0,0,0,0,0,0,0,0,0,0,0,0,0,0,0,0,0,0,0,0,0,0,0,0,0,0,0,0,0,0,0,0,0,0,0,0,0,0,0,0,0,0,0,0,0,0,0,0,0,0,0,0,0,0]
[169,0,0,0,0,0,0,0,0,0,0,0,0,0,0,0,0,0,0,0,0,0,0,0,0,0,0,0,0,0,0,0,0,0,0,0,0,0,0,0,0,0,0,0,0,0,0,0,0,0,0,0,0,0,0,0,0,0,0,0,0,0,0,0,0,0,0,0,0,0,0,0,0,0,0,0,0,0,0,0,0,0,0,0,0,0,0,0,0,0,0,0,0,0,0,0,0,0,0,0,0,0,0,0,0,0,0,0,0,0,0,0,0,0,0,0,0,0,0,0,0,0,0,0,0,0,0,0,0,0,0,0]
[170,0,0,0,0,0,0,0,0,0,0,0,0,0,0,0,0,0,0,0,0,0,0,0,0,0,0,0,0,0,0,0,0,0,0,0,0,0,0,0,0,0,0,0,0,0,0,0,0,0,0,0,0,0,0,0,0,0,0,0,0,0,0,0,0,0,0,0,0,0,0,0,0,0,0,0,0,0,0,0,0,0,0,0,0,0,0,0,0,0,0,0,0,0,0,0,0,0,0,0,0,0,0,0,0,0,0,0,0,0,0,0,0,0,0,0,0,0,0,0,0,0,0,0,0,0,0,0,0,0,0,0]
[171,0,0,0,0,0,0,0,0,0,0,0,0,0,0,0,0,0,0,0,0,0,0,0,0,0,0,0,0,0,0,0,0,0,0,0,0,0,0,0,0,0,0,0,0,0,0,0,0,0,0,0,0,0,0,0,0,0,0,0,0,0,0,0,0,0,0,0,0,0,0,0,0,0,0,0,0,0,0,0,0,0,0,0,0,0,0,0,0,0,0,0,0,0,0,0,0,0,0,0,0,0,0,0,0,0,0,0,0,0,0,0,0,0,0,0,0,0,0,0,0,0,0,0,0,0,0,0,0,0,0,0]
[172,0,0,0,0,0,0,0,0,0,0,0,0,0,0,0,0,0,0,0,0,0,0,0,0,0,0,0,0,0,0,0,0,0,0,0,0,0,0,0,0,0,0,0,0,0,0,0,0,0,0,0,0,0,0,0,0,0,0,0,0,0,0,0,0,0,0,0,0,0,0,0,0,0,0,0,0,0,0,0,0,0,0,0,0,0,0,0,0,0,0,0,0,0,0,0,0,0,0,0,0,0,0,0,0,0,0,0,0,0,0,0,0,0,0,0,0,0,0,0,0,0,0,0,0,0,0,0,0,0,0,0]
[173,0,0,0,0,0,0,0,0,0,0,0,0,0,0,0,0,0,0,0,0,0,0,0,0,0,0,0,0,0,0,0,0,0,0,0,0,0,0,0,0,0,0,0,0,0,0,0,0,0,0,0,0,0,0,0,0,0,0,0,0,0,0,0,0,0,0,0,0,0,0,0,0,0,0,0,0,0,0,0,0,0,0,0,0,0,0,0,0,0,0,0,0,0,0,0,0,0,0,0,0,0,0,0,0,0,0,0,0,0,0,0,0,0,0,0,0,0,0,0,0,0,0,0,0,0,0,0,0,0,0,0]
[174,0,0,0,0,0,0,0,0,0,0,0,0,0,0,0,0,0,0,0,0,0,0,0,0,0,0,0,0,0,0,0,0,0,0,0,0,0,0,0,0,0,0,0,0,0,0,0,0,0,0,0,0,0,0,0,0,0,0,0,0,0,0,0,0,0,0,0,0,0,0,0,0,0,0,0,0,0,0,0,0,0,0,0,0,0,0,0,0,0,0,0,0,0,0,0,0,0,0,0,0,0,0,0,0,0,0,0,0,0,0,0,0,0,0,0,0,0,0,0,0,0,0,0,0,0,0,0,0,0,0,0]
[175,0,0,0,0,0,0,0,0,0,0,0,0,0,0,0,0,0,0,0,0,0,0,0,0,0,0,0,0,0,0,0,0,0,0,0,0,0,0,0,0,0,0,0,0,0,0,0,0,0,0,0,0,0,0,0,0,0,0,0,0,0,0,0,0,0,0,0,0,0,0,0,0,0,0,0,0,0,0,0,0,0,0,0,0,0,0,0,0,0,0,0,0,0,0,0,0,0,0,0,0,0,0,0,0,0,0,0,0,0,0,0,0,0,0,0,0,0,0,0,0,0,0,0,0,0,0,0,0,0,0,0]
[176,0,0,0,0,0,0,0,0,0,0,0,0,0,0,0,0,0,0,0,0,0,0,0,0,0,0,0,0,0,0,0,0,{"$f":"INDIRECT($C$33&AH$32&ROW()-$C$34)","v":0},0,0,0,0,0,0,0,0,0,0,0,0,0,0,0,{"$f":"INDIRECT($C$33&AX$32&ROW()-$C$34)","v":0},0,0,0,0,0,0,0,0,0,0,0,0,0,0,0,0,0,0,0,0,0,0,0,0,0,0,0,0,0,0,0,{"$f":"INDIRECT($C$33&CD$32&ROW()-$C$34)","v":0},0,0,0,0,0,0,0,0,0,0,0,0,0,0,0,0,0,0,0,0,0,0,0,0,0,0,0,0,0,0,0,0,0,0,0,0,0,0,0,0,0,0,0,0,0,0,0,0,0,0]
[177,0,0,0,0,0,0,0,0,0,0,0,0,0,0,0,0,{"$f":"INDIRECT($C$33&R$32&ROW()-$C$34)","v":0},0,0,0,0,0,0,0,0,0,0,0,0,0,0,0,0,0,0,0,0,0,0,{"$f":"INDIRECT($C$33&AO$32&ROW()-$C$34)","v":0},0,0,0,0,0,0,0,0,0,0,0,0,0,0,0,0,{"$f":"INDIRECT($C$33&BF$32&ROW()-$C$34)","v":0},0,0,0,0,0,0,0,0,0,0,0,0,0,0,0,{"$f":"INDIRECT($C$33&BV$32&ROW()-$C$34)","v":0},0,0,0,0,0,0,0,0,0,0,0,0,0,0,0,0,0,0,0,0,0,0,0,0,0,0,0,0,0,0,0,0,0,0,0,0,0,0,0,0,0,0,0,0,0,0,0,0,0,0,0,0,0,0,0,0,0,0]
[178,0,{"$f":"INDIRECT($C$33&C$32&ROW()-$C$34)","v":0},0,0,0,0,0,0,0,0,0,0,0,0,0,0,0,0,0,0,0,0,0,0,0,0,0,0,0,0,0,0,0,0,0,0,0,0,0,0,0,0,0,0,0,0,0,0,0,0,0,0,0,0,0,0,0,0,0,0,0,0,0,0,0,0,0,0,0,0,0,0,0,0,0,0,0,0,0,0,0,0,0,0,0,0,0,0,0,0,0,0,0,0,0,0,0,0,0,0,0,0,0,0,0,0,0,0,0,0,0,0,0,0,0,0,0,0,0,0,0,0,0,0,0,0,0,0,0,0,0]
[179,0,0,0,0,0,0,0,0,0,0,0,0,0,0,0,0,0,0,0,0,0,0,0,0,0,0,0,0,0,0,0,0,0,0,0,0,0,0,0,0,0,0,0,0,0,0,0,0,0,0,0,0,0,0,0,0,0,0,0,0,0,0,0,0,0,0,0,0,0,0,0,0,0,0,0,0,0,0,0,0,0,0,0,0,0,0,0,0,0,0,0,0,0,0,0,0,0,0,0,0,0,0,0,0,0,0,0,0,0,0,0,0,0,0,0,0,0,0,0,0,0,0,0,0,0,0,0,0,0,0,0]
[180,0,0,0,0,0,0,0,0,0,0,0,0,0,0,0,0,0,0,0,0,0,0,0,0,0,0,0,0,0,0,0,0,0,0,0,0,0,0,0,0,0,0,0,0,0,0,0,0,0,0,0,0,0,0,0,0,0,0,0,0,0,0,0,0,0,0,0,0,0,0,0,0,0,0,0,0,0,0,0,0,0,0,0,0,0,0,0,0,0,0,0,0,0,0,0,0,0,0,0,0,0,0,0,0,0,0,0,0,0,0,0,0,0,0,0,0,0,0,{"$f":"INDIRECT($C$33&DP$32&ROW()-$C$34)","v":0},0,0,0,0,0,0,0,0,0,0,0,0]
[181,0,0,0,0,0,0,0,0,0,0,0,0,0,0,0,0,0,0,0,0,0,0,0,0,0,0,0,0,0,0,0,0,0,0,0,0,0,0,0,0,0,0,0,0,0,0,0,0,0,0,0,0,0,0,0,0,0,0,0,0,0,0,0,0,0,0,0,0,0,0,0,0,0,0,0,0,0,0,0,0,0,0,0,0,0,0,0,0,0,0,0,0,0,0,0,0,0,0,0,0,0,0,0,0,0,0,0,0,0,0,0,0,0,0,0,0,0,0,0,0,0,0,0,0,0,0,0,0,0,0,0]
[182,0,0,0,0,0,0,0,0,0,0,0,0,0,0,0,0,0,0,0,0,0,0,0,0,0,0,0,0,0,0,0,0,0,0,0,0,0,0,0,0,0,0,0,0,0,0,0,0,0,0,0,0,0,0,0,0,0,0,0,0,0,0,0,0,0,0,0,0,0,0,0,0,0,0,0,0,0,0,0,0,0,0,0,0,0,0,0,0,0,0,0,0,0,0,0,0,0,0,0,0,{"$f":"INDIRECT($C$33&CX$32&ROW()-$C$34)","v":0},0,0,0,0,0,0,0,0,0,0,0,0,0,0,0,0,0,0,0,0,0,0,0,0,0,0,0,0,0,0]
[183,0,0,0,0,0,0,0,0,0,0,0,0,0,0,0,0,0,0,0,0,0,0,0,0,0,0,0,0,0,0,0,0,0,0,0,0,0,0,0,0,0,0,0,0,0,0,0,0,0,0,0,0,0,0,0,0,0,0,0,0,0,0,0,0,0,0,0,0,0,0,0,0,0,0,0,0,0,0,0,0,0,0,0,0,{"$f":"INDIRECT($C$33&CH$32&ROW()-$C$34)","v":0},0,0,0,0,0,0,0,0,0,0,0,0,0,0,0,0,0,0,0,0,0,0,0,0,0,0,0,0,0,0,0,0,0,0,0,0,0,0,0,0,0,0,0,0,0,0]
[184,0,0,0,0,0,0,0,0,0,0,0,0,0,0,0,0,0,0,0,0,0,0,0,0,0,0,0,0,0,0,0,0,0,0,0,0,0,0,0,0,0,0,0,0,0,0,0,0,0,0,0,0,0,0,0,0,0,0,0,0,0,0,0,0,0,0,0,0,0,0,0,0,0,0,0,0,0,0,0,0,0,0,0,0,0,0,0,0,0,0,0,0,0,0,0,0,0,0,0,0,0,0,0,0,0,0,0,0,0,0,0,0,0,0,0,0,0,0,0,0,0,0,0,0,0,0,0,0,0,0,0]
[185,0,0,0,0,0,0,0,0,0,0,0,0,0,0,0,0,0,0,0,0,0,0,0,0,0,0,0,0,0,0,0,0,0,0,0,0,0,0,0,0,0,0,0,0,0,0,0,0,0,0,0,0,0,0,0,0,0,0,0,0,0,0,0,0,0,0,0,0,0,0,0,0,0,0,0,0,0,0,0,0,0,0,0,0,0,0,0,0,0,0,0,0,0,0,0,0,0,0,0,0,0,0,0,0,0,0,0,0,0,0,0,0,0,0,0,0,0,0,0,0,0,0,0,0,0,0,0,0,0,0,0]
[186,0,0,0,0,0,0,0,0,0,0,0,0,0,0,0,0,0,0,0,0,0,0,0,0,0,0,0,0,0,0,0,0,0,0,0,0,0,0,0,0,0,0,0,0,0,0,0,0,0,0,0,0,0,0,0,0,0,0,0,0,0,0,0,0,0,0,0,0,0,0,0,0,0,0,0,0,0,0,0,0,0,0,0,0,0,0,0,0,0,0,0,0,0,0,0,0,0,0,0,0,0,0,0,0,0,0,0,0,0,0,0,0,0,0,0,0,0,0,0,0,0,0,0,0,0,0,0,0,0,0,0]
[187,0,0,0,0,0,0,0,0,0,0,0,0,0,0,0,0,0,0,0,0,0,0,0,0,0,0,0,0,0,0,0,0,0,0,0,0,0,0,0,0,0,0,0,0,0,0,0,0,0,0,0,0,0,0,0,0,0,0,0,0,0,0,0,0,0,0,0,0,0,0,0,0,0,0,0,0,0,0,0,0,0,0,0,0,0,0,0,0,0,0,0,0,0,0,0,0,0,0,0,0,0,0,0,0,0,0,0,0,0,0,0,0,0,0,0,0,0,0,0,0,0,0,0,0,0,0,0,0,0,0,0]
[188,0,0,0,0,0,0,0,0,0,0,0,0,0,0,0,0,0,0,0,0,0,0,0,0,0,0,0,0,0,0,0,0,0,0,0,0,0,0,0,0,0,0,0,0,0,0,0,0,0,0,0,0,0,0,0,0,0,0,0,0,0,0,0,0,0,0,0,0,0,0,0,0,0,0,0,0,0,0,0,0,0,0,0,0,0,0,0,0,0,0,0,0,0,0,0,0,0,0,0,0,0,0,0,0,0,0,0,0,0,0,0,0,0,0,0,0,0,0,0,0,0,0,0,0,0,0,0,0,0,0,0]
[189,0,0,0,0,0,0,0,0,0,0,0,0,0,0,0,0,0,0,0,0,0,0,0,0,0,0,0,0,0,0,0,0,0,0,0,0,0,0,0,0,0,0,0,0,0,0,0,0,0,0,0,0,0,0,0,0,0,0,0,0,0,0,0,0,0,0,0,0,0,0,0,0,0,0,0,0,0,0,0,0,0,0,0,0,0,0,0,0,0,0,0,0,0,0,0,0,0,0,0,0,0,0,0,0,0,0,0,0,0,0,0,0,0,0,0,0,0,0,0,0,0,0,0,0,0,0,0,0,0,0,0]
[190,0,0,0,0,0,0,0,0,0,0,0,0,0,0,0,0,0,0,0,0,0,0,0,0,0,0,0,0,0,0,0,0,0,0,0,0,0,0,0,0,0,0,0,0,0,0,0,0,0,0,0,0,0,0,0,0,0,0,0,0,0,0,0,0,0,0,0,0,0,0,0,0,0,0,0,0,0,0,0,0,0,0,0,0,0,0,0,0,0,0,0,0,0,0,0,0,0,0,0,0,0,0,0,0,0,0,0,0,0,0,0,0,0,0,0,0,0,0,0,0,0,0,0,0,0,0,{"$f":"INDIRECT($C$33&DX$32&ROW()-$C$34)","v":0},0,0,0,0]
[191,0,0,0,0,0,0,0,0,0,0,0,0,0,0,0,0,0,0,0,0,0,0,0,0,0,0,0,0,0,0,0,0,0,0,0,0,0,0,0,0,0,0,0,0,0,0,0,0,0,0,0,0,0,0,0,0,0,0,0,0,0,0,0,0,0,0,0,0,0,0,0,0,0,0,0,0,0,0,0,0,0,0,0,0,0,0,0,0,0,0,0,0,0,0,0,0,0,0,0,0,0,0,0,0,0,0,0,0,0,0,0,0,0,0,0,0,0,0,0,0,0,0,0,0,0,0,0,0,0,0,0]
[192,0,0,0,0,0,0,0,0,0,0,0,0,0,0,0,0,0,0,0,0,0,0,0,0,0,0,0,0,0,0,0,0,0,0,0,0,0,0,0,0,0,0,0,0,0,0,0,0,0,0,0,0,0,0,0,0,0,0,0,0,0,0,0,0,0,0,0,0,0,0,0,0,0,0,0,0,0,0,0,0,0,0,0,0,0,0,0,0,0,0,0,0,0,0,0,0,0,0,0,0,0,0,0,0,0,0,0,0,0,0,0,0,0,0,0,0,0,0,0,0,0,0,0,0,0,0,0,0,0,0,0]
[193,0,0,0,0,0,0,0,0,0,0,0,0,0,0,0,0,0,0,0,0,0,0,0,0,0,0,0,0,0,0,0,0,0,0,0,0,0,0,0,0,0,0,0,0,0,0,0,0,0,{"$f":"INDIRECT($C$33&AY$32&ROW()-$C$34)","v":0},0,0,0,0,0,0,0,0,0,0,0,0,0,0,0,0,0,0,0,0,0,0,0,0,0,0,0,0,0,0,0,0,0,0,0,0,0,0,0,0,0,0,0,0,0,0,0,0,0,0,0,0,0,0,0,0,0,0,0,0,0,0,0,0,0,0,0,0,0,0,0,0,0,0,0,0,0,0,0,0,0]
[194,0,0,0,0,0,0,0,0,0,0,0,0,0,0,0,0,0,0,0,0,0,0,0,0,0,0,0,0,0,0,0,0,0,0,0,0,0,0,0,0,0,0,0,0,0,0,0,0,0,0,0,0,0,0,0,0,0,0,0,0,0,0,0,0,0,0,0,0,0,0,0,0,0,0,0,0,0,0,0,0,0,0,0,0,0,0,0,0,0,0,0,0,0,0,0,0,0,0,0,0,0,0,0,0,0,0,0,0,0,0,0,0,0,0,0,0,0,0,0,0,0,0,0,0,0,0,0,0,0,0,0]
[{"$f":"A224+1","v":195},0,0,0,0,0,0,0,0,0,0,0,0,0,0,0,0,0,0,0,0,0,0,0,0,0,0,0,0,0,0,0,0,0,0,0,0,0,0,0,0,0,0,0,0,0,0,0,0,0,0,0,0,0,0,0,0,0,0,0,0,0,0,0,0,0,0,0,0,0,0,0,0,0,0,0,0,0,0,0,0,0,0,0,0,0,0,0,0,0,0,0,0,0,0,0,0,0,0,0,0,0,0,0,0,0,0,0,0,0,0,0,0,0,0,0,0,0,0,0,0,0,0,0,0,0,0,0,0,0,0,0]
[196,0,0,0,0,0,0,0,0,0,0,0,0,0,0,0,0,0,0,0,0,0,0,0,0,0,0,0,0,0,0,0,0,0,0,0,0,0,0,0,0,0,0,0,0,0,0,0,0,0,0,0,0,0,0,0,0,0,0,0,0,0,0,0,0,0,0,0,0,0,0,0,0,0,0,0,0,0,0,0,0,0,0,0,0,0,0,0,0,0,0,0,0,0,0,0,0,0,0,0,0,0,0,0,0,0,0,0,0,0,0,0,0,0,0,0,0,0,{"$f":"INDIRECT($C$33&DO$32&ROW()-$C$34)","v":0},0,0,0,0,0,0,0,0,0,0,0,0,0]
[197,0,0,0,0,0,0,0,0,0,0,0,0,0,0,0,0,0,0,0,0,0,0,0,0,0,0,0,0,0,0,0,0,0,0,0,0,0,0,0,0,0,0,0,0,0,0,0,0,0,0,0,0,0,0,0,0,0,0,0,0,0,0,0,0,0,0,0,0,0,0,0,0,0,0,0,0,0,0,0,0,0,0,0,0,0,0,0,0,0,0,0,0,0,0,0,0,0,0,0,0,0,0,0,0,0,0,0,0,0,0,0,0,0,0,0,0,0,0,0,0,0,0,0,0,0,0,0,0,0,0,0]
[198,0,0,0,0,0,0,0,0,0,0,0,0,0,0,0,0,0,0,0,0,0,0,0,0,0,0,0,0,0,0,0,0,0,0,0,0,0,0,0,0,0,0,0,0,0,0,0,0,0,0,0,0,0,0,0,0,0,0,0,0,0,0,0,0,0,0,0,0,0,0,0,0,0,0,0,0,0,0,0,0,0,0,0,0,0,0,0,0,0,0,0,0,0,0,0,0,0,0,0,0,0,0,0,0,0,0,0,0,0,0,0,0,0,0,0,0,0,0,0,0,0,0,0,0,0,0,0,0,0,0,0]
[199,0,0,0,0,{"$f":"INDIRECT($C$33&F$32&ROW()-$C$34)","v":0},0,0,0,0,0,0,0,0,0,0,0,0,0,0,0,0,0,0,0,0,0,0,0,0,0,0,0,0,0,0,0,0,0,{"$f":"INDIRECT($C$33&AN$32&ROW()-$C$34)","v":0},0,0,0,0,0,0,0,0,0,0,0,0,0,0,0,0,0,0,0,0,0,0,0,0,0,0,0,0,0,0,0,0,0,0,0,0,0,0,0,0,0,0,0,0,0,0,0,0,0,0,0,0,0,0,0,0,0,0,0,0,0,0,0,0,0,0,0,0,0,0,0,0,0,0,0,0,0,0,0,0,0,0,0,0,0,0,0,0,0,0,0,0]
[200,0,{"$f":"INDIRECT($C$33&C$32&ROW()-$C$34)","v":0},0,0,0,0,0,0,0,0,0,0,0,0,0,0,0,0,0,0,0,0,0,0,0,0,0,0,0,0,0,0,0,0,0,0,0,0,0,0,0,0,0,0,0,0,0,0,0,0,0,0,0,0,0,0,0,0,0,0,0,0,0,0,0,0,0,0,0,0,0,0,0,0,0,0,0,0,0,0,0,0,0,0,0,0,0,0,0,0,0,0,0,0,0,0,0,0,0,0,0,0,0,0,0,0,0,0,0,0,0,0,0,0,0,0,0,0,0,0,0,0,0,0,0,0,0,0,0,0,0]
[201,{"$f":"IF(LEN(C231)>1,A231,0)","v":0},0,0,0,0,0,0,0,0,0,0,0,0,0,0,0,0,0,0,{"$f":"INDIRECT($C$33&U$32&ROW()-$C$34)","v":0},0,0,0,0,0,0,0,0,0,0,0,0,0,0,0,{"$f":"INDIRECT($C$33&AK$32&ROW()-$C$34)","v":0},0,0,0,0,0,0,0,0,0,0,0,0,0,0,0,0,0,0,0,0,0,0,0,0,0,0,0,0,0,{"$f":"INDIRECT($C$33&BO$32&ROW()-$C$34)","v":0},0,0,0,0,0,0,0,0,0,0,0,0,0,0,0,{"$f":"INDIRECT($C$33&CE$32&ROW()-$C$34)","v":0},0,0,0,0,0,0,0,0,0,0,0,0,0,0,0,0,0,{"$f":"INDIRECT($C$33&CW$32&ROW()-$C$34)","v":0},0,0,0,0,0,0,0,0,0,0,0,0,0,0,0,0,0,0,0,0,0,0,0,0,0,0,0,0,0,0,0]
[202,0,0,0,0,0,0,0,0,0,0,0,0,0,0,0,0,0,0,0,0,0,0,0,0,0,0,0,0,0,0,0,0,0,0,0,0,0,0,0,0,0,0,0,0,0,0,0,0,0,0,0,0,0,0,0,0,0,0,0,0,0,0,0,0,0,0,0,0,0,0,0,0,0,0,0,0,0,0,0,0,0,0,0,0,0,0,0,0,0,{"$f":"INDIRECT($C$33&CM$32&ROW()-$C$34)","v":0},0,0,0,0,0,0,0,0,0,0,0,0,0,0,0,0,0,0,0,0,0,0,0,0,0,0,0,0,0,0,0,0,0,0,0,0,0,0,0,0,0]
[203,0,0,0,0,0,0,0,0,0,0,0,0,0,0,0,0,0,0,0,0,0,0,0,0,0,0,0,0,0,0,0,0,0,0,0,0,0,0,0,0,0,0,0,0,0,0,0,0,0,0,0,0,0,0,0,0,0,0,0,0,0,0,0,0,0,0,0,0,0,0,0,0,0,0,0,0,0,0,0,0,0,0,0,0,0,0,0,0,0,0,0,0,0,0,0,0,0,0,0,0,0,0,0,0,0,0,0,0,0,0,0,0,0,0,0,0,0,0,0,0,0,0,0,0,0,0,0,0,0,0,0]
[204,0,0,0,0,0,0,0,0,0,0,0,0,0,0,0,0,0,0,0,0,0,0,0,0,0,0,0,0,0,0,0,0,0,0,0,0,0,0,0,0,0,0,0,0,0,0,0,0,0,0,0,0,0,0,0,0,0,0,0,0,0,0,0,0,0,0,0,0,0,0,0,0,0,0,0,0,0,0,0,0,0,0,0,0,0,0,0,0,0,0,0,0,0,0,0,0,0,0,0,0,0,0,0,0,0,0,0,0,0,0,0,0,0,0,0,0,0,0,0,0,0,0,0,0,0,0,0,0,0,0,0]

{"sheet":"TheArtOfExcel ©","index":3,"n_rows":2,"n_cols":2,"rows_kept":2,"cut":false,"hidden":false,"merged":[]}
[]
[null,"Editable Dashboard\n2016\n\n \n\nCreated By Arsen Makaryan - TheArtOfExcel\n\n"]

{"sheet":"DashBoard","index":4,"n_rows":18,"n_cols":13,"rows_kept":18,"cut":false,"hidden":false,"merged":[[6,2,6,9],[13,12,14,19]]}
[]
[]
[]
[]
[]
[]
[null,null,{"$f":"VLOOKUP(Settings!D7,Settings!E7:G29,3,0)","v":"Opel sells"}]
[null,{"$f":"Settings!B10","v":5},null,null,{"$f":"IFERROR(HLOOKUP(Settings!B$4,TheDate,$B8,0),\"\")","v":"2017-11-30"},{"$f":"IFERROR(HLOOKUP(Settings!C$4,TheDate,$B8,0),\"\")","v":"2018-11-30"},{"$f":"IFERROR(HLOOKUP(Settings!D$4,TheDate,$B8,0),\"\")","v":"2019-11-30"},{"$f":"IFERROR(HLOOKUP(Settings!E$4,TheDate,$B8,0),\"\")","v":"2020-11-30"},{"$f":"IFERROR(HLOOKUP(Settings!F$4,TheDate,$B8,0),\"\")","v":"2021-11-30"},{"$f":"IFERROR(HLOOKUP(Settings!G$4,TheDate,$B8,0),\"\")","v":"2022-11-30"}]
[null,{"$f":"IF(Settings!B11>Settings!B12,Settings!B12,Settings!B11)","v":6},{"$f":"IFERROR(HLOOKUP(\"Hodvac\",TheDate,$B9,0),\"\")","v":"Opel Adam"},null,{"$f":"IFERROR(HLOOKUP(Settings!B$4,TheDate,$B9,0),\"\")","v":111},{"$f":"IFERROR(HLOOKUP(Settings!C$4,TheDate,$B9,0),\"\")","v":273},{"$f":"IFERROR(HLOOKUP(Settings!D$4,TheDate,$B9,0),\"\")","v":403},{"$f":"IFERROR(HLOOKUP(Settings!E$4,TheDate,$B9,0),\"\")","v":443},{"$f":"IFERROR(HLOOKUP(Settings!F$4,TheDate,$B9,0),\"\")","v":262},{"$f":"IFERROR(HLOOKUP(Settings!G$4,TheDate,$B9,0),\"\")","v":462}]
[null,{"$f":"B9+1","v":7},"Opel Admiral",null,{"$f":"IFERROR(HLOOKUP(Settings!B$4,TheDate,$B10,0),\"\")","v":459},{"$f":"IFERROR(HLOOKUP(Settings!C$4,TheDate,$B10,0),\"\")","v":249},{"$f":"IFERROR(HLOOKUP(Settings!D$4,TheDate,$B10,0),\"\")","v":324},{"$f":"IFERROR(HLOOKUP(Settings!E$4,TheDate,$B10,0),\"\")","v":122},{"$f":"IFERROR(HLOOKUP(Settings!F$4,TheDate,$B10,0),\"\")","v":454},{"$f":"IFERROR(HLOOKUP(Settings!G$4,TheDate,$B10,0),\"\")","v":242}]
[null,8,"Opel Agila",null,{"$f":"IFERROR(HLOOKUP(Settings!B$4,TheDate,$B11,0),\"\")","v":130},{"$f":"IFERROR(HLOOKUP(Settings!C$4,TheDate,$B11,0),\"\")","v":327},{"$f":"IFERROR(HLOOKUP(Settings!D$4,TheDate,$B11,0),\"\")","v":488},{"$f":"IFERROR(HLOOKUP(Settings!E$4,TheDate,$B11,0),\"\")","v":447},{"$f":"IFERROR(HLOOKUP(Settings!F$4,TheDate,$B11,0),\"\")","v":189},{"$f":"IFERROR(HLOOKUP(Settings!G$4,TheDate,$B11,0),\"\")","v":135}]
[null,9,"Opel Ampera",null,{"$f":"IFERROR(HLOOKUP(Settings!B$4,TheDate,$B12,0),\"\")","v":351},{"$f":"IFERROR(HLOOKUP(Settings!C$4,TheDate,$B12,0),\"\")","v":460},{"$f":"IFERROR(HLOOKUP(Settings!D$4,TheDate,$B12,0),\"\")","v":152},{"$f":"IFERROR(HLOOKUP(Settings!E$4,TheDate,$B12,0),\"\")","v":274},{"$f":"IFERROR(HLOOKUP(Settings!F$4,TheDate,$B12,0),\"\")","v":469},{"$f":"IFERROR(HLOOKUP(Settings!G$4,TheDate,$B12,0),\"\")","v":344}]
[null,10,"Opel Antara",null,{"$f":"IFERROR(HLOOKUP(Settings!B$4,TheDate,$B13,0),\"\")","v":472},{"$f":"IFERROR(HLOOKUP(Settings!C$4,TheDate,$B13,0),\"\")","v":123},{"$f":"IFERROR(HLOOKUP(Settings!D$4,TheDate,$B13,0),\"\")","v":177},{"$f":"IFERROR(HLOOKUP(Settings!E$4,TheDate,$B13,0),\"\")","v":135},{"$f":"IFERROR(HLOOKUP(Settings!F$4,TheDate,$B13,0),\"\")","v":103},{"$f":"IFERROR(HLOOKUP(Settings!G$4,TheDate,$B13,0),\"\")","v":411}]
[null,11,"Opel Ascona",null,{"$f":"IFERROR(HLOOKUP(Settings!B$4,TheDate,$B14,0),\"\")","v":152},{"$f":"IFERROR(HLOOKUP(Settings!C$4,TheDate,$B14,0),\"\")","v":218},{"$f":"IFERROR(HLOOKUP(Settings!D$4,TheDate,$B14,0),\"\")","v":112},{"$f":"IFERROR(HLOOKUP(Settings!E$4,TheDate,$B14,0),\"\")","v":302},{"$f":"IFERROR(HLOOKUP(Settings!F$4,TheDate,$B14,0),\"\")","v":438},{"$f":"IFERROR(HLOOKUP(Settings!G$4,TheDate,$B14,0),\"\")","v":162},null,null,{"$f":"Text!D3","v":"There is no comment"}]
[null,12,"Opel Astra",null,{"$f":"IFERROR(HLOOKUP(Settings!B$4,TheDate,$B15,0),\"\")","v":201},{"$f":"IFERROR(HLOOKUP(Settings!C$4,TheDate,$B15,0),\"\")","v":299},{"$f":"IFERROR(HLOOKUP(Settings!D$4,TheDate,$B15,0),\"\")","v":480},{"$f":"IFERROR(HLOOKUP(Settings!E$4,TheDate,$B15,0),\"\")","v":276},{"$f":"IFERROR(HLOOKUP(Settings!F$4,TheDate,$B15,0),\"\")","v":426},{"$f":"IFERROR(HLOOKUP(Settings!G$4,TheDate,$B15,0),\"\")","v":180}]
[null,13,"Opel Astra Cabrio",null,{"$f":"IFERROR(HLOOKUP(Settings!B$4,TheDate,$B16,0),\"\")","v":222},{"$f":"IFERROR(HLOOKUP(Settings!C$4,TheDate,$B16,0),\"\")","v":329},{"$f":"IFERROR(HLOOKUP(Settings!D$4,TheDate,$B16,0),\"\")","v":246},{"$f":"IFERROR(HLOOKUP(Settings!E$4,TheDate,$B16,0),\"\")","v":324},{"$f":"IFERROR(HLOOKUP(Settings!F$4,TheDate,$B16,0),\"\")","v":270},{"$f":"IFERROR(HLOOKUP(Settings!G$4,TheDate,$B16,0),\"\")","v":461}]
[null,14,"Opel Astra Coupe Bertone",null,{"$f":"IFERROR(HLOOKUP(Settings!B$4,TheDate,$B17,0),\"\")","v":498},{"$f":"IFERROR(HLOOKUP(Settings!C$4,TheDate,$B17,0),\"\")","v":441},{"$f":"IFERROR(HLOOKUP(Settings!D$4,TheDate,$B17,0),\"\")","v":430},{"$f":"IFERROR(HLOOKUP(Settings!E$4,TheDate,$B17,0),\"\")","v":235},{"$f":"IFERROR(HLOOKUP(Settings!F$4,TheDate,$B17,0),\"\")","v":469},{"$f":"IFERROR(HLOOKUP(Settings!G$4,TheDate,$B17,0),\"\")","v":303}]
[null,null,null,null,null,null,null,null,null,"Report Template created By Arsen Makaryan - TheArtOfExcel"]

{"sheet":"Opel","index":5,"n_rows":55,"n_cols":85,"rows_kept":55,"cut":false,"hidden":false,"merged":[]}
["Opel sells","2016-01-31","2016-02-28","2016-03-31","2016-04-30","2016-05-31","2016-06-30","2016-07-31","2016-08-31","2016-09-30","2016-10-31","2016-11-30","2016-12-31","2017-01-31","2017-02-28","2017-03-31","2017-04-30","2017-05-31","2017-06-30","2017-07-31","2017-08-31","2017-09-30","2017-10-31","2017-11-30","2017-12-31","2018-01-31","2018-02-28","2018-03-31","2018-04-30","2018-05-31","2018-06-30","2018-07-31","2018-08-31","2018-09-30","2018-10-31","2018-11-30","2018-12-31","2019-01-31","2019-03-01","2019-03-31","2019-04-30","2019-05-31","2019-06-30","2019-07-31","2019-08-31","2019-09-30","2019-10-31","2019-11-30","2019-12-31","2020-01-31","2020-02-28","2020-03-31","2020-04-30","2020-05-31","2020-06-30","2020-07-31","2020-08-31","2020-09-30","2020-10-31","2020-11-30","2020-12-31","2021-01-31","2021-02-28","2021-03-31","2021-04-30","2021-05-31","2021-06-30","2021-07-31","2021-08-31","2021-09-30","2021-10-31","2021-11-30","2021-12-31","2022-01-31","2022-02-28","2022-03-31","2022-04-30","2022-05-31","2022-06-30","2022-07-31","2022-08-31","2022-09-30","2022-10-31","2022-11-30","2022-12-31"]
["Opel Adam",145,213,261,266,291,466,397,459,375,441,218,181,174,427,389,344,424,347,276,459,177,149,111,410,241,498,199,418,460,138,422,124,182,217,273,467,402,211,213,297,496,275,262,245,183,336,403,125,478,103,488,330,175,167,491,454,111,159,443,289,289,105,208,205,124,152,352,331,175,453,262,492,157,357,410,452,398,467,429,417,225,449,462,285]
["Opel Admiral",470,168,341,364,103,301,246,475,467,404,281,419,435,180,217,169,444,105,104,217,452,188,459,386,414,310,376,214,256,150,100,458,387,322,249,456,425,500,310,424,287,131,131,364,217,273,324,307,147,364,363,130,151,228,187,216,341,445,122,263,131,199,161,371,163,180,178,195,158,121,454,119,371,330,104,403,301,128,214,275,165,125,242,112]
["Opel Agila",313,147,178,386,101,308,217,123,395,334,375,241,271,456,395,461,258,474,389,231,310,399,130,426,427,281,293,327,277,425,465,261,419,250,327,353,383,428,149,325,261,439,179,266,192,286,488,144,230,192,398,218,343,447,353,139,200,322,447,172,484,251,160,390,256,427,454,143,432,279,189,427,256,344,264,492,317,125,420,248,324,472,135,340]
["Opel Ampera",403,315,337,480,402,138,152,276,272,187,362,451,155,177,390,420,223,278,203,179,190,385,351,431,458,428,362,458,472,140,294,473,298,257,460,477,316,217,267,461,301,242,178,352,331,333,152,387,346,350,277,491,182,131,458,265,283,478,274,217,482,201,264,131,322,292,499,138,429,129,469,288,109,278,490,110,477,315,494,319,490,326,344,129]
["Opel Antara",148,265,109,253,261,306,437,138,183,406,116,140,413,442,303,444,259,196,117,354,190,287,472,113,169,148,387,412,309,312,253,289,276,161,123,300,494,105,267,416,325,325,473,358,463,288,177,452,356,199,491,158,286,136,315,470,200,203,135,489,154,378,453,427,115,486,466,340,347,337,103,159,122,181,327,254,346,206,210,158,436,267,411,197]
["Opel Ascona",180,118,356,153,410,273,228,163,263,337,125,367,346,247,105,214,401,345,344,143,401,334,152,158,255,357,481,378,495,301,485,273,425,243,218,113,196,111,480,202,217,260,125,462,432,411,112,386,470,198,304,470,406,171,416,140,218,304,302,481,343,445,441,131,181,486,265,440,496,260,438,414,365,107,478,211,114,409,178,273,375,302,162,130]
["Opel Astra",418,248,411,403,224,201,108,333,369,390,426,275,357,119,153,320,180,495,163,438,180,357,201,165,482,455,308,291,217,386,489,168,492,239,299,247,155,484,176,397,264,451,237,486,405,398,480,293,384,112,412,453,188,185,247,142,421,193,276,109,259,428,132,263,177,170,490,349,188,142,426,260,209,219,462,216,184,158,336,445,387,102,180,114]
["Opel Astra Cabrio",286,249,422,481,125,348,458,314,272,288,246,223,419,168,431,344,166,364,477,419,364,329,222,147,444,153,360,454,198,216,264,488,495,103,329,131,389,260,112,204,141,490,319,345,281,454,246,318,148,335,474,428,202,266,387,401,128,279,324,489,385,348,181,386,235,157,204,128,260,192,270,103,137,230,234,492,127,237,457,172,251,267,461,413]
["Opel Astra Coupe Bertone",276,382,373,413,340,122,249,441,372,280,249,410,138,131,237,412,368,244,297,284,315,421,498,274,379,309,380,122,492,478,444,330,433,456,441,178,446,473,448,256,368,376,479,426,373,225,430,407,475,406,336,457,425,324,469,363,362,186,235,137,417,200,233,329,387,257,438,387,199,500,469,157,468,487,173,364,293,209,295,277,426,290,303,279]
["Opel Astra GTC",419,233,447,392,116,296,231,453,297,421,371,354,332,392,158,179,216,103,241,308,489,138,140,482,228,327,346,107,412,406,449,132,100,317,296,263,450,434,355,343,445,315,495,195,165,291,234,106,377,199,181,405,269,445,116,378,189,474,207,107,218,250,179,184,248,255,192,104,390,373,196,122,458,292,189,262,489,139,178,305,134,477,377,197]
["Opel Astra OPC",371,431,436,312,146,197,343,200,365,156,164,131,204,112,305,376,149,109,280,216,120,167,267,173,251,424,295,205,317,203,299,156,363,109,480,239,292,248,250,275,411,149,118,274,266,158,407,313,337,182,478,153,250,499,191,223,494,243,436,297,284,346,327,409,460,167,105,429,144,330,355,360,326,221,487,361,417,207,175,455,193,110,426,139]
["Opel Astra Twin Top",398,276,453,163,117,211,142,258,235,495,145,379,291,285,299,316,341,238,435,488,376,414,161,417,295,373,464,319,460,452,122,141,204,212,407,213,321,260,208,194,408,492,102,307,261,309,284,453,407,178,313,151,486,345,424,497,496,234,170,132,164,334,138,180,462,209,374,223,279,500,177,184,487,143,489,295,303,437,364,203,246,253,470,457]
["Opel Bedford Blitz",338,214,388,476,123,266,470,491,118,196,238,183,394,201,217,404,330,190,392,416,340,124,395,450,362,258,359,479,169,286,292,434,179,458,483,303,401,278,383,339,297,431,156,281,100,347,288,427,116,242,440,190,156,197,283,334,360,160,401,250,207,258,210,161,265,371,407,412,424,249,295,211,105,198,370,116,418,119,128,355,494,430,431,177]
["Opel Calibra",497,429,465,287,413,417,377,290,488,205,280,165,123,204,454,338,486,129,245,330,253,453,184,407,268,364,355,449,390,113,265,197,247,339,239,389,255,393,300,230,393,286,192,366,450,239,286,146,340,438,382,239,106,241,192,107,226,436,392,497,206,406,214,227,300,163,465,301,308,176,318,410,186,122,365,275,143,271,267,432,218,164,184,134]
["Opel Combo",146,308,180,220,277,474,335,407,320,253,105,232,135,170,478,443,282,461,252,410,491,126,414,294,209,336,208,279,120,303,206,175,247,375,329,240,411,372,341,313,247,116,134,378,287,354,298,484,211,159,307,244,190,403,324,222,235,462,212,232,458,235,500,121,184,426,495,386,312,350,225,339,363,413,363,375,452,387,363,217,195,348,117,406]
["Opel Commodore",444,460,434,134,374,484,476,419,185,107,376,395,496,260,497,167,349,198,458,173,445,381,421,147,439,347,413,180,216,331,180,168,350,157,425,426,211,120,337,371,159,194,149,263,294,408,447,135,336,443,359,401,184,279,425,246,482,300,141,398,132,412,480,108,426,245,122,138,121,409,360,142,264,301,204,307,217,140,230,426,450,332,253,441]
["Opel Corsa",293,166,274,179,251,226,389,291,325,484,135,299,300,442,228,133,263,386,440,141,341,346,155,284,223,158,316,271,288,228,159,496,133,326,241,444,417,261,302,248,250,360,485,273,433,287,189,277,307,420,157,344,314,139,192,328,346,213,218,160,335,346,452,415,233,371,249,250,212,157,453,179,358,169,434,150,249,470,428,417,162,262,120,489]
["Opel Corsa OPC",177,392,315,224,124,148,390,314,326,472,477,126,297,329,237,166,389,429,107,263,193,208,491,455,498,239,180,439,386,476,184,474,286,482,268,306,420,309,406,219,327,180,284,339,253,413,155,404,125,152,333,408,106,415,374,196,478,373,146,397,482,203,289,229,459,120,412,109,346,265,442,150,382,270,110,306,306,369,340,489,238,334,315,315]
["Opel Diplomat",233,324,392,311,244,462,458,428,338,417,134,285,446,123,375,242,483,447,113,304,225,102,281,165,173,187,440,455,391,432,178,435,177,489,153,265,393,442,331,375,421,370,101,130,312,483,250,155,441,207,402,470,413,409,356,472,124,294,146,412,448,381,198,166,238,122,165,397,210,128,180,467,304,455,123,348,189,418,329,459,400,473,190,398]
["Opel Frontera A",355,409,123,408,259,491,131,351,138,471,300,162,436,271,359,222,178,445,332,462,370,387,198,363,190,447,177,385,134,348,253,287,352,147,267,415,231,294,254,301,293,440,282,496,162,175,106,116,130,258,484,430,405,125,204,153,211,241,329,103,163,475,425,279,172,422,149,458,362,279,360,208,215,432,476,473,199,240,304,103,412,175,183,481]
["Opel Frontera B",427,224,221,164,205,459,191,186,299,222,413,105,380,339,262,355,317,490,232,322,103,195,346,467,375,306,416,169,237,319,167,358,311,422,374,306,128,385,106,107,317,274,379,184,101,226,258,265,384,352,459,104,154,409,374,223,486,168,126,453,453,362,246,363,454,267,164,345,345,250,217,469,188,157,165,136,380,373,429,222,348,102,417,200]
["Opel GT",257,146,228,235,225,367,323,130,400,228,186,168,413,279,220,161,112,129,253,418,494,100,134,287,334,289,186,437,186,312,311,183,410,298,259,457,446,159,451,127,271,252,418,261,235,310,249,370,127,202,378,313,196,268,211,448,266,277,201,383,157,252,314,187,133,216,129,136,351,350,431,383,433,273,202,196,190,161,320,405,295,306,100,234]
["Opel Insignia",134,470,489,119,213,310,161,302,384,216,228,202,248,145,154,467,300,430,486,425,404,273,301,315,423,260,456,446,170,211,139,245,112,344,102,329,425,393,272,412,204,173,354,186,356,251,332,307,128,300,343,311,343,265,360,238,324,293,289,130,188,200,337,157,189,338,407,102,292,309,362,414,260,232,256,158,102,483,367,175,299,290,166,241]
["Opel Insignia Country Tourer",389,324,438,121,145,497,211,212,130,173,357,463,306,157,480,432,228,403,489,320,221,321,266,129,180,264,268,329,494,267,306,214,375,397,147,382,137,194,135,297,390,299,420,107,478,351,263,169,138,152,431,455,477,250,303,323,443,486,359,475,130,146,434,431,209,338,177,439,124,232,264,495,365,208,166,342,299,146,336,193,189,151,319,163]
["Opel Insignia Hatchback",406,253,380,352,417,444,120,232,493,181,461,292,280,479,112,365,399,212,368,193,218,387,385,411,381,115,374,335,314,409,202,161,491,174,250,462,352,316,410,409,308,304,308,332,112,452,179,316,438,404,109,199,363,360,346,103,325,236,130,337,169,189,416,203,394,114,342,483,366,358,144,427,253,387,471,168,181,228,487,361,492,305,361,172]
["Opel Insignia OPC",325,269,295,366,155,350,454,328,211,436,357,232,189,218,462,210,134,373,285,341,496,470,462,322,231,284,488,362,489,430,266,154,463,497,390,120,496,354,284,174,126,418,138,396,342,225,484,440,480,472,445,425,216,104,346,107,160,161,164,326,477,393,436,304,135,125,246,417,149,470,276,149,266,259,205,178,317,248,274,319,408,421,219,410]
["Opel Insignia OPC Tourer Sports",125,218,155,117,321,293,256,321,486,419,163,237,263,123,335,171,236,130,389,395,439,183,112,398,447,431,271,482,173,488,237,269,440,148,293,378,380,275,138,367,415,222,261,374,185,363,189,245,211,242,270,425,336,342,286,205,401,287,232,159,296,118,203,425,377,494,143,267,172,319,416,399,499,330,189,103,127,192,116,398,242,224,320,102]
["Opel Insignia Sports Tourer",487,461,119,485,202,199,236,182,334,425,368,205,483,368,288,478,153,477,216,450,479,294,200,486,466,251,319,381,459,340,469,398,299,195,298,279,203,329,418,260,102,245,382,245,211,397,321,401,427,374,301,172,330,411,469,196,192,441,114,348,429,452,102,210,423,328,210,102,283,260,342,355,194,236,160,489,261,461,414,147,188,174,465,388]
["Opel Kadett",464,163,402,495,405,116,290,470,103,362,166,404,143,175,352,159,272,421,386,260,407,249,368,104,125,278,294,398,152,290,269,284,367,487,402,130,208,266,100,467,130,323,247,288,261,355,283,395,380,130,252,144,313,302,363,331,361,219,394,257,201,342,171,127,453,176,280,321,280,467,158,289,376,324,216,233,250,489,152,424,471,473,317,472]
["Opel Kapitan",201,469,312,139,165,361,279,418,137,185,354,277,322,303,398,389,373,438,415,167,122,266,500,357,257,484,328,340,195,431,397,484,382,474,244,145,369,138,438,442,483,300,216,302,102,452,391,200,415,424,177,389,452,349,147,315,357,236,236,330,430,194,184,484,499,428,332,292,324,356,259,487,193,335,354,372,244,376,177,349,478,214,412,426]
["Opel Manta",346,239,246,177,418,196,271,382,210,234,105,352,150,199,133,285,106,148,460,209,481,107,444,465,151,371,482,325,176,481,435,438,156,464,285,110,306,478,206,424,171,360,359,376,200,345,341,122,357,453,277,292,205,310,154,104,139,268,497,258,196,106,170,117,367,239,316,134,380,235,205,140,307,218,354,214,391,165,370,451,108,323,292,266]
["Opel Meriva",452,176,444,450,344,242,359,275,234,385,182,212,123,395,194,195,358,477,285,404,422,329,246,263,431,164,326,331,456,123,498,210,496,408,287,243,178,420,371,111,421,362,189,347,159,371,249,495,450,384,425,480,391,387,192,169,207,274,498,254,250,264,173,165,360,490,292,243,465,445,150,398,475,264,459,179,311,155,480,482,456,245,432,185]
["Opel Meriva OPC",110,351,150,299,258,303,457,286,249,162,302,473,231,278,101,178,233,463,344,421,220,353,102,374,164,308,311,112,243,242,138,400,386,333,428,423,361,266,453,114,283,233,305,183,189,186,414,468,395,323,170,369,371,199,295,194,340,452,131,171,190,480,229,328,145,117,142,327,126,259,188,243,160,473,308,467,294,222,135,451,316,312,278,389]
["Opel Mokka",488,450,216,271,285,384,333,198,256,170,195,114,145,493,345,106,139,406,175,305,419,463,467,453,284,420,430,334,499,132,115,191,462,163,201,344,200,374,145,301,313,163,118,413,268,375,380,224,110,402,290,195,252,475,304,471,285,145,307,270,110,182,312,329,338,174,154,151,497,433,476,445,165,354,203,104,433,283,121,401,454,268,469,434]
["Opel Monterey",129,224,149,468,279,381,309,323,327,196,320,496,112,355,491,426,431,303,240,348,233,443,382,262,392,250,479,330,160,433,169,369,224,372,390,230,493,480,453,173,439,488,461,336,163,445,232,281,226,253,172,476,466,160,402,346,215,222,381,464,145,408,309,104,432,224,444,332,223,341,159,444,437,160,493,489,215,194,314,181,175,378,306,230]
["Opel Monza",305,337,220,478,155,328,123,274,183,272,497,205,407,449,163,341,342,141,298,483,200,146,360,321,369,253,444,331,312,251,483,367,354,477,188,273,119,498,310,109,443,261,390,259,114,221,362,130,400,332,249,302,436,395,452,270,171,410,169,466,342,398,149,143,248,235,392,474,297,332,236,422,442,450,486,315,338,421,108,224,127,208,453,229]
["Opel Movano",307,153,287,149,253,332,493,204,489,347,331,482,427,229,198,428,127,498,366,341,488,225,425,472,168,177,379,134,225,311,101,246,211,405,316,227,243,294,466,288,104,176,481,458,349,244,359,113,435,350,292,331,481,185,344,388,326,230,225,384,491,160,249,210,263,416,455,325,151,127,221,379,408,325,183,215,478,448,350,113,320,337,403,175]
["Opel Olympia",264,214,477,330,343,474,180,178,254,479,456,103,307,188,406,373,366,109,213,421,130,338,389,272,446,273,360,420,435,381,334,232,349,148,365,291,168,414,291,188,184,180,148,392,486,130,411,369,402,306,465,173,339,440,356,184,241,232,496,364,436,300,124,426,181,375,421,148,252,463,377,293,409,139,376,454,166,412,263,125,444,234,400,281]
["Opel Olympia Rekord",393,198,267,418,181,283,329,352,271,227,267,361,245,134,436,269,391,217,196,151,433,148,259,268,149,314,239,256,255,306,431,379,451,291,237,144,189,435,308,321,322,285,210,172,119,458,484,350,489,381,339,376,294,144,459,160,324,463,142,184,371,469,180,164,113,177,235,287,203,340,413,340,398,146,365,370,353,458,237,229,223,258,414,307]
["Opel Omega",386,217,388,327,470,371,344,250,332,401,396,102,326,261,407,145,104,413,221,245,376,491,445,186,450,244,334,346,191,425,371,428,484,329,469,320,299,206,475,494,404,355,333,368,206,435,380,398,135,290,418,165,203,474,455,477,110,321,463,396,394,149,265,229,267,371,310,379,111,375,297,416,204,185,364,200,146,133,324,439,314,247,411,361]
["Opel Rekord",154,299,346,334,124,340,217,475,169,200,121,142,435,197,263,249,384,302,302,377,167,192,116,226,350,304,337,154,474,415,363,296,190,195,456,481,371,430,147,308,492,193,197,373,366,338,299,499,379,500,214,120,220,433,300,276,307,288,412,395,304,471,221,177,410,230,449,154,105,204,473,324,466,358,146,420,229,237,340,451,345,241,230,454]
["Opel Senator",365,304,298,134,322,287,333,395,338,278,238,116,413,248,265,239,495,288,373,472,272,282,159,253,197,195,334,163,271,282,301,389,182,346,226,408,193,107,416,355,438,321,398,373,112,210,426,120,214,394,259,176,396,413,164,494,119,425,382,200,393,215,483,160,275,408,391,214,115,349,300,316,475,195,494,248,145,263,205,414,106,280,128,421]
["Opel Signum",107,226,263,202,183,133,203,425,206,382,187,203,163,432,319,268,234,209,122,178,211,488,126,142,189,307,183,376,248,305,176,487,350,171,118,481,340,471,258,399,333,209,438,319,238,339,194,160,478,384,293,344,271,207,222,268,356,430,334,181,374,309,340,119,474,180,329,469,229,170,429,122,111,461,374,169,230,434,116,147,474,220,242,303]
["Opel Sintra",275,261,302,329,224,163,106,497,253,165,374,128,258,394,296,205,262,361,158,121,233,291,363,158,451,391,345,217,319,259,441,444,420,286,149,466,180,195,119,141,406,213,277,349,235,364,330,432,127,445,446,250,148,342,460,317,378,243,247,165,125,161,121,471,269,465,241,286,106,499,117,334,360,227,421,106,100,353,231,278,227,309,197,474]
["Opel Speedster",111,383,403,256,407,198,466,265,488,405,101,246,453,186,336,117,427,480,191,341,145,423,237,197,179,392,233,371,139,390,372,385,338,367,179,319,278,497,105,456,239,158,111,341,470,276,341,277,344,246,229,436,341,375,159,188,303,248,350,107,296,411,476,446,331,256,366,194,136,474,256,341,249,209,475,156,131,250,360,391,353,339,340,278]
["Opel Super Six",128,106,175,322,191,336,493,130,362,129,226,172,360,203,365,497,118,409,368,310,478,297,346,304,436,161,124,179,155,333,489,380,412,448,267,383,361,446,227,316,234,119,174,243,211,112,241,345,146,489,286,486,365,399,342,156,337,288,364,348,414,491,390,229,332,117,183,116,495,234,412,378,297,460,214,447,465,284,251,364,333,282,145,374]
["Opel Tigra",410,240,219,376,392,212,315,136,192,320,246,467,413,439,114,335,490,489,166,204,403,132,247,441,331,423,373,247,374,295,404,276,359,238,198,374,269,131,211,367,201,182,468,460,205,125,180,267,171,485,147,151,427,239,235,471,423,460,138,376,357,273,389,297,254,491,151,444,181,213,130,392,487,215,366,120,254,495,404,409,401,429,277,350]
["Opel Tigra TwinTop",332,469,203,233,388,316,274,416,146,299,260,298,125,239,126,419,412,213,188,477,224,296,373,144,171,411,355,347,476,432,385,115,402,136,153,184,159,227,108,295,494,150,321,334,252,111,192,339,379,384,316,125,128,261,125,354,404,417,165,477,304,396,400,472,411,106,366,133,280,182,248,494,431,254,221,357,426,114,111,205,438,436,240,332]
["Opel Vectra",444,214,407,464,218,132,475,171,429,408,130,332,441,328,133,329,117,393,162,366,231,213,358,229,303,487,282,418,111,265,162,248,268,207,358,210,462,469,385,215,127,312,126,329,295,171,369,127,142,337,139,444,199,353,467,197,383,313,312,497,290,406,335,326,104,295,430,172,424,284,478,216,130,334,467,278,343,311,446,405,185,124,220,412]
["Opel Vectra OPC",147,106,209,174,410,118,200,256,431,214,407,243,484,239,293,435,300,359,400,432,125,436,280,217,128,456,285,104,423,189,161,359,290,158,426,420,286,245,139,150,421,153,204,326,336,154,202,225,232,236,283,422,433,139,366,272,314,426,406,405,229,450,500,183,256,160,184,434,400,363,375,269,166,255,481,168,327,213,436,334,367,456,235,306]
["Opel Vita",216,314,415,124,181,268,333,465,306,478,210,242,220,226,171,244,182,107,343,414,106,461,328,371,370,451,297,485,480,299,110,191,289,277,481,354,201,404,222,163,309,201,439,206,288,417,452,150,305,326,290,472,105,286,261,418,182,235,496,369,391,247,494,150,355,410,169,237,389,208,239,407,144,159,130,373,303,441,288,322,203,500,214,499]
["Opel Vivaro",213,263,354,382,141,109,150,315,173,155,225,355,379,272,491,160,479,227,474,278,278,469,116,224,129,116,112,178,481,371,444,210,474,413,117,256,282,443,486,101,411,428,436,108,344,207,228,281,471,495,243,189,380,433,434,153,416,454,188,325,268,445,143,242,465,361,202,415,384,247,475,386,347,454,363,161,295,412,479,467,231,367,390,490]
["Opel Zafira",231,302,243,483,124,352,175,154,185,161,378,151,282,454,175,216,231,305,226,171,135,356,161,436,242,258,153,337,242,386,318,135,307,233,500,258,195,494,223,184,127,143,184,295,285,451,234,167,458,197,227,320,278,353,245,113,468,151,124,132,420,269,199,168,421,496,302,453,234,256,268,313,456,221,371,395,183,220,200,458,147,272,235,171]
["Opel Zafira OPC",446,205,484,468,152,449,253,410,230,311,269,394,305,216,109,326,125,446,441,410,387,274,496,470,424,121,237,188,278,270,164,181,420,418,396,297,134,349,486,395,333,310,277,306,348,475,403,332,325,392,143,307,348,242,394,116,415,448,212,314,269,216,438,188,177,228,297,482,188,314,221,275,108,168,430,290,266,123,301,401,377,329,270,460]

{"sheet":"BMW","index":6,"n_rows":25,"n_cols":85,"rows_kept":25,"cut":false,"hidden":false,"merged":[]}
["BMW sells","2016-01-31","2016-02-28","2016-03-31","2016-04-30","2016-05-31","2016-06-30","2016-07-31","2016-08-31","2016-09-30","2016-10-31","2016-11-30","2016-12-31","2017-01-31","2017-02-28","2017-03-31","2017-04-30","2017-05-31","2017-06-30","2017-07-31","2017-08-31","2017-09-30","2017-10-31","2017-11-30","2017-12-31","2018-01-31","2018-02-28","2018-03-31","2018-04-30","2018-05-31","2018-06-30","2018-07-31","2018-08-31","2018-09-30","2018-10-31","2018-11-30","2018-12-31","2019-01-31","2019-03-01","2019-03-31","2019-04-30","2019-05-31","2019-06-30","2019-07-31","2019-08-31","2019-09-30","2019-10-31","2019-11-30","2019-12-31","2020-01-31","2020-02-28","2020-03-31","2020-04-30","2020-05-31","2020-06-30","2020-07-31","2020-08-31","2020-09-30","2020-10-31","2020-11-30","2020-12-31","2021-01-31","2021-02-28","2021-03-31","2021-04-30","2021-05-31","2021-06-30","2021-07-31","2021-08-31","2021-09-30","2021-10-31","2021-11-30","2021-12-31","2022-01-31","2022-02-28","2022-03-31","2022-04-30","2022-05-31","2022-06-30","2022-07-31","2022-08-31","2022-09-30","2022-10-31","2022-11-30","2022-12-31"]
["BMW 1 series",337,337,712,245,520,603,638,489,220,710,679,757,350,394,662,674,653,406,546,724,790,711,555,648,477,740,227,445,469,716,368,484,343,258,325,239,604,426,794,639,769,622,627,338,367,361,678,636,568,247,333,430,784,222,310,726,582,747,627,414,576,473,348,796,517,278,694,299,383,465,280,616,424,428,462,612,454,260,572,368,640,271,439,751]
["BMW 1 series Coupe",693,758,765,568,677,200,578,465,252,253,390,356,274,625,224,761,727,429,658,590,259,303,482,734,374,260,280,717,415,717,770,518,624,743,304,575,689,613,561,446,341,604,706,389,416,523,659,202,740,435,666,441,790,288,770,376,664,425,667,275,252,706,483,334,322,730,628,476,636,232,359,635,717,438,422,392,268,411,326,742,467,318,288,485]
["BMW 3 series",683,572,296,215,784,632,408,680,397,755,644,484,336,331,602,540,635,479,781,398,267,785,445,302,767,655,670,733,327,540,328,253,570,744,409,699,726,543,339,565,686,212,616,352,537,285,615,684,340,425,782,262,633,710,308,399,569,722,790,408,613,696,231,474,224,749,756,757,241,616,669,574,571,651,285,400,490,650,256,542,424,754,447,627]
["BMW 3 series Compact",275,334,521,592,623,576,629,370,324,546,366,360,717,217,774,238,248,641,591,758,468,357,680,547,619,744,492,672,687,402,522,580,538,373,788,645,663,665,338,244,649,635,300,670,307,703,252,259,481,750,381,650,283,719,413,686,460,759,395,237,494,365,730,539,614,749,220,605,420,388,482,700,550,731,361,325,561,725,382,573,634,663,511,765]
["BMW 3 series Convertible",605,741,582,368,643,728,643,395,727,535,638,644,731,622,451,314,349,669,420,248,750,591,445,365,390,559,796,518,590,553,429,256,252,750,620,618,312,585,510,472,319,402,510,757,709,383,383,369,301,627,684,455,480,348,406,507,323,654,800,651,676,712,791,782,273,781,239,407,243,453,602,752,394,411,500,464,519,461,791,582,639,453,531,225]
["BMW 3 series Coupe",410,731,561,321,742,674,296,640,355,647,786,487,219,334,697,603,405,574,541,746,361,542,208,234,715,608,463,792,538,474,509,697,612,275,589,387,474,486,700,474,758,277,303,608,627,786,325,257,365,569,720,680,776,304,452,792,616,342,758,767,753,445,329,699,660,329,624,680,613,519,375,675,427,628,335,724,313,785,707,374,420,210,784,340]
["BMW 3 series Gran Turismo",357,758,527,476,493,697,535,300,456,725,320,515,330,748,372,471,460,464,440,668,429,415,401,514,552,754,729,516,719,560,647,756,305,783,513,548,310,549,377,584,388,394,490,378,709,216,753,213,343,694,374,550,315,455,670,480,288,415,312,338,789,645,449,488,441,779,743,680,411,768,280,737,634,527,546,761,255,782,422,556,490,343,564,411]
["BMW 3 series Touring",582,383,448,592,747,456,700,392,726,778,329,208,271,649,350,431,312,585,591,444,471,699,297,366,513,628,215,293,717,577,599,334,775,701,800,312,313,325,691,336,447,225,470,525,365,237,558,481,329,559,770,407,689,392,722,451,341,419,514,516,308,790,793,236,426,330,287,723,394,363,753,709,269,455,629,377,416,293,597,665,506,764,274,226]
["BMW 5 series",462,624,553,600,680,651,645,757,586,279,753,471,785,403,669,386,725,382,719,486,534,670,724,698,613,355,495,520,778,384,726,704,275,764,310,506,578,786,200,268,548,420,475,436,722,240,306,290,387,372,361,775,501,331,505,297,547,573,415,583,204,564,220,301,564,307,735,463,604,690,738,312,222,800,535,599,583,787,636,367,344,638,606,232]
["BMW 5 series Gran Turismo",523,608,544,527,779,654,451,475,692,374,373,537,502,286,741,293,357,242,793,394,552,411,605,529,576,387,760,702,417,737,773,504,679,612,476,574,335,385,779,553,289,408,384,263,768,798,379,660,639,535,602,464,798,320,468,489,337,779,247,208,375,350,715,759,303,671,440,407,213,221,267,712,280,509,554,400,381,727,511,800,370,354,280,251]
["BMW 5 series Touring",614,792,327,600,244,259,287,606,720,329,246,582,636,438,283,790,545,273,573,334,567,787,264,474,545,604,715,688,692,788,443,269,362,319,627,322,365,434,607,549,380,533,730,296,675,222,651,243,528,320,232,733,296,276,346,319,347,737,348,386,276,296,700,294,418,465,248,762,507,506,755,738,306,504,418,515,482,732,314,554,248,419,592,487]
["BMW 6 series",799,675,318,698,585,535,616,297,667,580,771,418,550,585,474,751,516,338,331,640,514,599,459,650,402,670,205,228,289,707,235,223,544,399,367,345,684,564,335,665,683,372,412,521,282,496,275,223,580,290,369,618,281,401,724,232,660,724,631,604,511,378,697,382,284,465,478,212,713,487,437,701,609,377,728,628,697,338,536,697,463,237,733,697]
["BMW 7 series",367,487,272,524,277,301,259,729,288,669,684,653,265,446,502,316,240,274,235,460,542,284,512,392,581,447,733,375,649,712,219,531,707,266,774,738,597,535,700,213,241,249,277,626,341,641,262,434,573,684,369,548,279,571,257,223,594,440,501,539,799,461,737,208,228,556,272,223,407,393,606,585,225,308,251,563,645,208,504,785,755,571,353,654]
["BMW 8 series",376,267,438,799,514,233,456,442,701,681,433,459,524,589,473,202,656,343,307,503,433,585,787,532,266,775,571,790,263,640,466,573,508,251,287,309,238,728,291,539,792,506,438,741,742,257,719,267,236,282,552,478,353,687,458,358,482,427,646,656,741,747,256,535,272,200,428,611,221,313,679,460,605,268,619,347,661,259,457,557,771,543,739,627]
["BMW M3",463,471,447,333,651,440,789,533,260,645,785,633,660,783,729,351,664,712,495,763,782,494,629,580,293,290,430,613,748,390,394,434,422,588,758,566,604,337,534,550,318,761,646,248,215,255,369,744,329,768,588,583,536,251,290,628,518,566,419,445,686,676,688,561,798,590,743,588,640,240,356,367,565,386,322,446,603,251,372,420,792,400,314,239]
["BMW M3 Coupe",336,559,618,512,391,429,463,368,352,489,428,400,299,410,390,670,572,361,428,787,391,741,459,259,488,221,423,748,631,289,501,530,741,498,556,611,575,671,356,355,744,577,204,372,685,256,659,683,385,555,800,477,705,227,244,430,563,274,544,410,569,308,791,682,494,622,792,770,627,500,510,798,775,646,262,736,419,259,544,366,553,550,546,338]
["BMW M5",795,439,326,763,683,300,546,518,718,644,316,740,797,452,222,396,407,737,331,729,564,559,783,620,437,326,626,749,311,771,317,515,433,558,322,472,253,314,465,789,206,615,349,668,718,511,471,760,306,406,770,667,305,782,260,448,670,671,306,586,277,438,754,612,456,367,208,655,441,764,643,761,590,579,699,442,262,205,300,559,508,438,481,645]
["BMW X1",676,285,371,757,731,439,567,500,721,345,372,514,732,519,718,696,430,507,606,538,770,417,493,360,791,696,602,328,211,415,734,638,229,442,286,797,496,670,709,482,674,738,349,627,765,579,217,369,490,356,541,392,582,536,722,659,402,219,279,561,467,384,336,554,609,642,454,779,555,441,484,738,460,506,635,418,286,438,735,665,627,605,383,637]
["BMW X3",442,784,420,607,596,797,244,712,535,387,690,793,691,209,356,332,782,379,499,527,215,669,594,376,717,358,783,256,731,372,361,230,275,792,718,544,562,422,428,714,570,430,449,489,311,785,754,246,639,486,518,220,414,727,737,539,603,610,795,741,616,275,520,605,345,225,486,394,517,536,418,476,250,685,360,585,297,318,689,562,475,490,762,387]
["BMW X5",450,768,293,216,469,267,594,669,492,370,698,628,505,453,360,684,376,778,723,317,249,201,614,467,581,598,363,424,716,557,693,556,797,754,342,758,761,450,466,772,270,509,533,720,587,678,589,671,395,505,530,494,282,766,582,592,300,289,404,275,280,555,699,401,439,740,640,609,519,321,589,316,373,608,433,709,638,389,654,354,236,620,625,655]
["BMW X6",418,627,607,492,531,691,611,312,709,743,739,705,367,550,326,579,321,453,556,282,542,684,497,379,326,555,329,619,529,395,643,738,705,647,361,610,737,283,570,415,445,369,359,588,788,729,560,562,575,538,631,388,743,761,500,205,233,622,755,759,314,429,248,748,743,653,559,760,271,678,580,514,393,620,249,288,395,729,764,355,760,627,244,485]
["BMW X6 M",558,325,767,727,549,266,336,334,229,261,256,221,414,324,314,492,738,562,435,719,566,734,253,523,351,424,665,325,336,681,498,208,624,577,619,503,493,334,283,749,778,355,210,279,254,337,360,222,353,631,795,487,697,508,344,766,555,628,345,340,786,500,604,593,484,535,727,482,251,672,645,251,776,511,576,228,295,587,662,424,719,487,791,287]
["BMW Z3",685,518,767,203,735,748,589,518,472,697,581,271,382,544,630,238,364,534,459,557,693,259,358,341,245,560,204,670,328,394,481,559,579,201,774,579,321,793,505,738,734,635,242,495,380,534,398,652,304,225,486,524,550,695,436,686,293,546,202,598,795,575,448,217,216,772,443,334,752,607,662,736,606,796,759,443,756,407,674,760,785,491,295,669]
["BMW Z4",623,396,346,800,426,240,741,424,485,577,606,747,469,248,537,402,313,297,653,616,539,216,268,710,285,309,747,276,368,551,638,202,746,699,429,373,733,378,223,556,330,233,722,285,609,732,448,692,402,599,541,375,649,573,637,706,726,200,395,617,776,402,565,501,595,613,427,358,216,410,514,634,587,655,675,771,392,398,498,488,321,294,653,244]

{"sheet":"AUDI","index":7,"n_rows":25,"n_cols":85,"rows_kept":25,"cut":false,"hidden":false,"merged":[]}
["Audi sells","2016-01-31","2016-02-28","2016-03-31","2016-04-30","2016-05-31","2016-06-30","2016-07-31","2016-08-31","2016-09-30","2016-10-31","2016-11-30","2016-12-31","2017-01-31","2017-02-28","2017-03-31","2017-04-30","2017-05-31","2017-06-30","2017-07-31","2017-08-31","2017-09-30","2017-10-31","2017-11-30","2017-12-31","2018-01-31","2018-02-28","2018-03-31","2018-04-30","2018-05-31","2018-06-30","2018-07-31","2018-08-31","2018-09-30","2018-10-31","2018-11-30","2018-12-31","2019-01-31","2019-03-01","2019-03-31","2019-04-30","2019-05-31","2019-06-30","2019-07-31","2019-08-31","2019-09-30","2019-10-31","2019-11-30","2019-12-31","2020-01-31","2020-02-28","2020-03-31","2020-04-30","2020-05-31","2020-06-30","2020-07-31","2020-08-31","2020-09-30","2020-10-31","2020-11-30","2020-12-31","2021-01-31","2021-02-28","2021-03-31","2021-04-30","2021-05-31","2021-06-30","2021-07-31","2021-08-31","2021-09-30","2021-10-31","2021-11-30","2021-12-31","2022-01-31","2022-02-28","2022-03-31","2022-04-30","2022-05-31","2022-06-30","2022-07-31","2022-08-31","2022-09-30","2022-10-31","2022-11-30","2022-12-31"]
["AUDI 80",138,257,53,162,299,263,252,88,92,272,304,276,257,183,80,55,208,225,157,75,339,296,69,223,120,244,205,88,346,237,286,54,172,189,116,62,98,350,100,144,229,77,260,182,213,307,197,105,313,320,266,265,318,83,307,239,175,286,131,181,316,95,176,219,127,228,327,66,250,112,229,152,171,50,164,187,208,342,66,247,278,220,110,87]
["AUDI 90",233,187,314,63,309,88,231,348,197,199,320,322,213,104,293,157,248,196,184,96,216,54,138,99,305,146,149,69,267,347,194,209,274,190,194,273,252,264,276,74,114,83,327,302,201,287,195,118,130,85,260,287,74,280,265,175,300,126,311,131,350,147,138,149,271,217,148,150,210,335,271,103,219,101,81,69,165,99,335,63,309,266,258,57]
["AUDI 100",201,67,165,112,64,304,129,317,148,261,109,331,117,289,299,117,255,50,280,320,244,149,225,59,215,56,209,350,282,125,197,235,303,263,308,54,275,227,188,332,109,121,157,268,54,301,176,64,74,240,72,122,315,143,160,107,51,56,329,221,186,149,320,149,169,255,276,244,178,268,311,85,94,326,277,233,235,54,165,167,307,114,312,229]
["AUDI 200",120,226,230,250,313,228,102,163,323,286,207,83,216,179,350,139,271,214,290,93,345,102,87,75,161,303,346,345,161,192,305,251,313,218,251,106,273,76,199,115,307,94,228,56,106,182,92,209,204,313,173,143,209,303,140,73,109,70,326,79,134,155,90,143,147,300,250,318,149,53,244,274,90,75,238,211,202,140,275,156,293,118,78,143]
["AUDI A3",126,165,171,97,120,150,343,167,102,56,263,183,127,266,281,219,279,77,51,319,205,231,324,301,95,92,157,106,217,189,282,189,208,309,315,52,57,175,285,337,90,96,337,322,316,191,128,284,301,63,317,104,206,160,234,139,311,164,79,266,255,221,57,104,199,160,117,212,118,270,155,335,75,57,328,111,300,338,62,322,268,318,188,338]
["AUDI A3 Sedan",140,329,233,79,314,75,205,265,184,241,296,201,316,122,73,174,268,316,279,220,226,131,215,292,245,242,133,203,182,51,256,309,248,57,344,96,268,291,81,185,236,336,210,334,310,155,242,203,173,95,52,324,152,263,201,290,173,248,225,260,238,68,118,331,93,342,127,216,331,50,267,242,166,183,311,259,167,157,91,85,134,343,103,190]
["AUDI A3 Sportback",200,289,184,288,250,211,70,232,307,103,168,293,194,296,102,273,298,270,92,341,299,339,64,90,55,136,289,60,132,185,310,315,240,150,305,98,252,290,51,349,261,242,54,212,74,168,242,197,329,56,226,295,169,160,336,89,239,155,80,100,295,58,178,135,102,92,312,156,176,273,63,295,232,237,122,340,323,350,325,85,213,278,241,70]
["AUDI A4",203,348,184,125,202,79,242,274,289,257,318,340,300,151,334,85,236,206,219,114,236,280,240,75,150,253,300,209,159,206,210,110,313,215,345,288,189,64,196,227,181,222,214,65,218,68,283,259,308,111,324,325,115,115,165,325,81,110,178,186,230,107,164,192,166,330,136,221,115,100,297,112,329,134,219,216,185,129,60,76,313,261,79,62]
["AUDI A4 Avant",227,108,308,278,286,325,92,284,109,159,323,301,288,142,340,89,117,268,277,139,193,63,109,58,285,257,172,82,226,303,211,54,305,301,59,140,275,341,228,96,53,149,295,263,236,265,73,135,274,324,266,305,161,183,177,194,150,159,216,60,204,303,69,343,234,341,154,312,226,250,238,236,83,328,250,195,274,141,280,230,313,83,76,142]
["AUDI A5",92,111,206,221,87,251,208,105,57,154,241,307,118,339,289,189,234,203,128,89,57,349,163,208,335,224,186,194,300,57,314,342,125,330,94,110,204,99,101,99,245,119,55,206,313,319,162,77,111,126,111,281,191,335,200,254,131,236,80,217,135,165,309,209,269,82,165,161,117,112,310,68,124,262,262,226,299,119,117,90,114,147,180,171]
["AUDI A5 Sportback",113,314,124,311,259,119,121,204,89,93,184,296,106,213,212,79,284,255,337,148,225,59,83,161,210,214,341,179,290,141,76,148,147,232,232,129,322,70,326,220,303,170,172,240,203,310,325,58,277,262,124,290,307,180,224,98,126,225,152,104,336,64,241,123,155,306,67,198,70,153,226,154,217,265,300,239,288,179,121,66,235,350,147,100]
["AUDI A6",67,252,228,239,229,287,50,127,185,275,260,197,312,265,300,347,275,61,304,288,127,74,265,209,260,323,214,263,104,94,140,176,256,270,276,265,304,113,178,114,68,245,170,222,94,135,75,325,193,118,197,220,192,330,108,89,63,283,246,224,248,235,107,87,246,233,107,296,283,292,156,216,164,297,77,131,149,131,244,141,167,261,246,177]
["AUDI A6 Avant",209,312,171,58,89,110,332,243,76,68,104,153,256,304,263,296,334,125,129,278,167,93,208,245,71,251,279,150,241,336,140,229,172,59,54,329,222,309,168,312,273,328,62,303,126,158,90,230,178,163,200,334,147,159,143,106,166,306,160,234,245,324,251,53,225,126,341,260,183,276,347,95,313,64,273,112,294,146,165,162,260,72,232,190]
["AUDI A7 Sportback",289,154,84,196,97,293,336,158,298,53,163,152,202,240,212,112,96,237,298,87,120,190,126,279,104,73,150,162,165,137,344,127,208,55,203,343,323,258,169,302,291,115,309,273,219,332,79,315,268,310,301,239,178,291,182,337,195,108,349,248,204,61,104,349,159,118,118,118,323,299,165,50,253,337,139,126,108,301,140,234,159,218,342,181]
["AUDI A8",63,305,60,245,171,166,60,245,313,249,316,344,207,314,176,234,285,204,246,147,285,281,136,183,315,177,163,137,116,232,65,181,311,236,311,52,108,223,317,345,273,328,163,106,203,237,81,208,211,148,265,205,315,105,146,242,53,344,183,267,316,87,71,332,244,118,91,232,212,138,91,246,327,347,312,196,291,275,144,130,70,306,193,142]
["AUDI Allroad",233,243,222,146,74,76,317,314,143,249,301,183,220,330,71,240,57,250,292,194,178,250,58,279,284,301,165,336,179,302,67,189,317,165,191,217,281,262,338,317,203,84,123,154,258,154,215,203,341,246,239,125,289,63,154,133,273,308,203,184,255,73,198,181,284,211,229,296,250,330,78,92,205,108,169,256,306,244,240,319,116,337,202,58]
["AUDI Coupe",175,128,78,305,66,63,191,87,213,204,222,299,262,242,348,50,219,125,183,143,75,102,268,307,310,179,146,244,346,194,276,318,253,255,339,151,141,192,225,298,323,71,213,192,267,56,225,314,185,223,160,216,270,321,270,256,155,196,331,274,87,337,160,303,215,238,119,226,243,61,324,144,248,175,169,296,229,114,119,266,185,162,157,124]
["AUDI Q3",286,72,232,57,248,294,327,56,70,171,129,151,211,263,139,292,294,345,65,265,326,208,301,350,308,280,123,286,196,248,90,309,195,279,244,210,302,305,280,175,210,146,52,179,98,314,122,109,256,337,257,88,146,314,91,121,178,278,75,180,241,148,335,308,168,179,96,129,136,311,301,213,171,215,140,299,161,325,262,345,86,162,332,294]
["AUDI Q5",111,56,235,336,118,50,70,81,68,129,252,180,334,256,164,307,87,329,318,199,141,139,123,273,85,170,113,335,78,108,262,331,310,157,55,324,287,182,118,71,239,206,191,156,323,50,268,331,162,208,61,56,167,193,86,110,117,198,267,314,321,146,286,306,54,171,258,82,221,67,127,241,80,91,257,142,207,193,232,114,244,309,157,86]
["AUDI Q7",217,333,321,203,64,215,155,60,98,164,115,221,328,93,339,217,57,92,216,129,238,154,327,54,260,116,337,300,320,190,128,210,316,188,262,328,339,311,166,275,135,204,139,93,284,179,263,133,133,99,350,212,274,173,128,189,194,217,304,157,53,346,182,236,220,94,78,199,66,173,76,297,236,228,331,272,85,251,109,347,98,242,347,58]
["AUDI S4",71,257,200,109,60,286,139,146,151,350,279,158,253,108,137,290,124,137,125,311,257,290,153,310,72,313,222,232,229,152,293,245,236,258,82,150,57,164,52,338,317,91,317,113,246,335,60,109,119,121,251,223,76,147,306,297,316,287,115,131,196,302,210,245,151,115,348,286,204,290,248,274,187,186,180,130,307,84,183,73,215,186,249,272]
["AUDI S6",66,344,219,349,126,160,239,191,156,182,152,150,51,303,346,259,63,193,317,316,245,135,138,307,101,339,336,185,183,280,168,133,133,126,241,107,197,106,295,165,226,96,106,299,112,89,120,219,169,50,192,98,185,304,228,339,130,70,301,139,50,81,85,245,348,230,276,179,151,110,160,197,271,92,272,87,181,144,201,271,125,338,306,205]
["AUDI S8",304,131,330,146,346,245,105,336,122,70,204,110,128,342,62,302,266,230,316,77,258,138,294,142,312,328,280,212,287,221,160,88,294,151,139,302,331,197,127,159,197,339,331,245,301,265,157,325,350,135,253,146,257,218,50,310,279,93,119,177,180,229,128,302,269,205,246,216,129,211,288,288,232,273,143,84,93,320,312,201,149,228,219,341]
["AUDI TT",137,242,329,350,343,108,68,93,270,325,240,93,195,153,282,81,267,184,228,206,315,233,56,59,162,115,254,118,331,201,116,121,91,148,127,111,331,208,202,89,107,93,155,315,310,222,305,251,273,234,65,160,264,175,337,226,333,297,185,250,256,167,102,330,138,221,128,179,154,248,286,126,222,313,50,265,60,80,197,322,317,182,253,115]

{"sheet":"Toyota","index":8,"n_rows":163,"n_cols":85,"rows_kept":163,"cut":false,"hidden":false,"merged":[]}
["Toyota sells","2016-01-31","2016-02-28","2016-03-31","2016-04-30","2016-05-31","2016-06-30","2016-07-31","2016-08-31","2016-09-30","2016-10-31","2016-11-30","2016-12-31","2017-01-31","2017-02-28","2017-03-31","2017-04-30","2017-05-31","2017-06-30","2017-07-31","2017-08-31","2017-09-30","2017-10-31","2017-11-30","2017-12-31","2018-01-31","2018-02-28","2018-03-31","2018-04-30","2018-05-31","2018-06-30","2018-07-31","2018-08-31","2018-09-30","2018-10-31","2018-11-30","2018-12-31","2019-01-31","2019-03-01","2019-03-31","2019-04-30","2019-05-31","2019-06-30","2019-07-31","2019-08-31","2019-09-30","2019-10-31","2019-11-30","2019-12-31","2020-01-31","2020-02-28","2020-03-31","2020-04-30","2020-05-31","2020-06-30","2020-07-31","2020-08-31","2020-09-30","2020-10-31","2020-11-30","2020-12-31","2021-01-31","2021-02-28","2021-03-31","2021-04-30","2021-05-31","2021-06-30","2021-07-31","2021-08-31","2021-09-30","2021-10-31","2021-11-30","2021-12-31","2022-01-31","2022-02-28","2022-03-31","2022-04-30","2022-05-31","2022-06-30","2022-07-31","2022-08-31","2022-09-30","2022-10-31","2022-11-30","2022-12-31"]
["Toyota 1000",664,665,758,929,867,339,303,628,578,301,851,546,690,833,939,928,388,829,630,687,723,548,760,813,405,397,464,858,855,945,689,746,545,348,485,718,614,506,928,385,768,488,947,384,716,785,618,520,846,928,391,705,376,392,417,594,381,929,873,386,637,424,672,316,685,762,837,606,616,397,559,383,611,801,740,657,894,316,504,777,554,783,575,887]
["Toyota 4Runner",763,619,940,671,745,524,756,808,931,483,673,786,426,526,769,497,490,942,822,841,599,388,549,848,359,354,568,735,494,719,805,723,520,695,671,504,399,823,844,317,543,533,465,370,869,829,877,641,519,728,328,442,766,794,334,722,562,717,509,626,450,417,926,773,761,937,898,454,464,793,431,571,787,922,827,514,837,778,714,808,847,314,346,513]
["Toyota Allex",586,371,921,836,784,700,459,694,950,355,467,492,781,889,537,751,488,684,758,503,720,870,834,796,692,386,451,779,937,689,420,679,472,921,549,498,560,560,432,749,919,905,893,768,910,521,583,833,510,474,550,599,351,433,601,673,403,910,871,675,630,316,820,689,545,322,608,696,423,501,614,598,449,851,902,932,869,802,531,812,439,876,423,475]
["Toyota Allion",647,507,513,789,886,678,640,873,902,725,942,862,540,322,906,421,318,587,311,908,528,849,409,471,382,685,361,407,408,584,795,513,446,815,728,371,875,538,870,307,517,701,818,775,831,792,754,796,570,567,620,933,932,588,592,484,609,420,457,781,584,464,711,742,817,817,644,759,434,899,829,878,703,612,907,930,634,367,917,651,932,926,775,816]
["Toyota Alphard",614,780,486,827,655,413,883,564,343,390,404,895,553,335,879,514,331,691,861,333,800,741,418,797,422,666,305,923,374,796,720,666,840,422,359,590,805,363,730,679,337,568,744,489,582,407,542,947,432,659,804,843,382,454,761,708,636,799,634,485,410,309,799,659,487,670,562,828,607,632,666,486,939,495,862,525,409,699,567,856,388,750,713,534]
["Toyota Altezza",923,950,307,898,824,324,603,466,929,899,747,738,941,537,597,447,767,435,864,873,588,349,855,639,601,510,578,463,864,478,321,426,506,566,378,492,458,375,800,634,728,474,335,901,789,387,875,345,521,333,339,425,729,672,849,705,613,396,836,332,939,774,365,707,626,561,315,390,717,543,566,804,747,867,691,682,405,683,363,905,653,472,590,801]
["Toyota Ardeo",721,340,615,435,704,807,558,616,867,809,930,360,525,787,653,850,742,863,682,688,823,670,745,339,414,332,919,881,687,610,689,903,672,643,638,714,439,778,847,619,481,612,938,418,571,673,645,393,317,713,881,507,537,444,909,605,504,593,457,347,341,335,747,471,731,906,950,739,578,665,572,566,601,677,775,840,486,366,831,402,418,568,656,529]
["Toyota Aristo",350,384,856,764,782,644,415,391,652,831,366,731,631,517,535,552,752,418,760,342,375,693,743,910,832,944,703,765,526,646,700,680,619,626,800,359,748,641,923,647,681,544,572,340,895,529,563,334,582,685,561,875,546,701,613,307,854,866,861,721,789,807,323,343,692,315,761,726,551,668,393,617,874,482,950,767,544,897,619,764,938,930,775,749]
["Toyota Aurion",304,490,825,306,317,728,737,319,479,512,531,423,476,611,700,640,683,669,445,571,574,540,326,663,600,327,945,672,842,923,747,456,553,613,675,662,672,626,950,385,697,567,716,513,746,812,925,700,360,741,603,379,715,582,520,337,891,939,564,364,502,841,353,478,865,348,881,461,300,673,518,922,776,650,637,389,947,853,522,783,625,403,543,663]
["Toyota Auris",694,621,772,751,464,578,921,510,891,325,825,517,877,807,553,785,313,626,664,653,802,360,514,326,899,449,568,667,671,804,406,421,322,818,928,367,875,732,307,502,437,637,422,936,386,419,827,770,711,728,576,798,887,551,441,731,742,579,946,450,701,353,518,672,439,477,373,563,382,466,741,889,423,351,746,521,468,548,758,571,566,372,784,381]
["Toyota Avalon",921,789,429,612,757,573,503,435,605,666,436,514,932,798,769,412,384,413,445,583,732,874,518,723,576,459,313,719,458,603,503,417,938,872,583,374,310,432,520,522,565,929,671,408,340,801,480,401,930,692,694,366,462,771,537,595,427,895,856,380,401,456,556,737,797,692,412,375,655,476,415,505,618,731,501,874,828,467,372,873,584,856,416,471]
["Toyota Avensis",490,467,705,704,662,677,387,881,535,564,796,933,367,821,725,734,833,607,573,721,585,719,945,375,658,392,822,554,598,925,739,472,835,636,342,743,442,647,734,874,567,902,686,498,747,346,680,623,794,685,523,894,354,649,761,716,414,347,347,611,593,552,620,594,849,734,529,340,441,415,657,358,474,884,640,588,393,640,537,624,692,630,878,835]
["Toyota Avensis Verso",752,599,700,482,788,352,794,506,305,737,574,904,593,326,804,367,428,532,434,398,437,816,903,676,472,748,453,474,354,321,563,909,394,375,330,369,360,747,607,646,816,683,805,487,940,634,928,777,544,358,658,711,520,342,543,750,789,845,837,515,597,480,346,311,735,911,849,660,664,742,820,870,918,711,467,811,558,667,650,394,766,659,892,366]
["Toyota Aygo",588,633,507,358,915,460,752,464,733,541,479,812,333,900,309,623,691,863,435,673,492,474,805,460,588,421,871,941,896,393,875,910,402,638,351,348,865,697,740,949,635,807,332,610,474,357,480,619,459,895,908,447,535,470,508,602,667,342,385,474,691,950,620,719,887,357,799,654,584,810,713,657,563,516,885,705,917,532,632,773,330,374,640,666]
["Toyota bB",308,721,639,833,922,319,920,859,418,913,949,374,934,667,430,540,608,682,362,336,804,911,611,574,827,632,571,605,814,771,799,305,382,856,653,535,584,326,345,523,453,837,479,817,625,461,337,702,572,736,301,405,439,878,478,908,399,520,566,606,575,332,870,758,835,702,374,725,786,598,825,892,484,384,454,396,620,387,520,315,884,388,633,837]
["Toyota Belta",336,557,310,929,763,412,558,920,940,330,912,890,905,631,365,507,831,303,894,647,566,861,398,865,421,930,880,837,711,391,726,519,925,866,471,485,778,604,545,544,798,330,420,719,413,575,314,839,809,398,898,704,339,793,557,851,509,367,733,305,860,503,755,528,482,370,348,896,816,644,841,720,573,589,915,427,859,669,366,435,907,942,772,540]
["Toyota Blade",422,748,523,318,796,815,738,436,930,770,704,337,906,608,562,416,389,531,560,695,655,619,670,854,733,632,735,428,519,366,318,821,383,621,311,534,795,587,860,507,580,385,631,456,854,658,440,863,644,752,432,474,331,350,848,922,833,938,599,658,411,321,553,525,314,584,739,909,341,307,354,617,504,635,860,657,946,857,540,725,611,865,545,654]
["Toyota Blizzard",919,351,530,751,608,307,692,588,529,913,691,379,826,614,341,512,795,690,400,889,818,403,444,418,885,464,332,620,840,778,581,559,696,682,770,733,715,945,755,787,936,889,647,904,799,866,382,774,324,720,737,633,837,849,450,682,845,909,606,654,586,500,666,446,365,453,528,591,856,789,839,909,383,674,847,499,742,678,678,767,851,658,932,725]
["Toyota Brevis",672,905,355,440,950,312,882,950,781,456,337,492,659,376,627,856,301,643,468,667,527,501,795,846,590,358,442,866,365,400,538,806,629,411,313,340,911,637,306,749,854,805,392,632,918,744,921,580,586,611,862,615,626,457,939,354,325,667,302,623,755,432,835,720,517,340,859,607,583,853,534,913,795,687,676,927,742,671,618,346,403,447,602,898]
["Toyota Caldina",718,381,945,406,883,742,764,436,937,859,639,398,924,536,700,704,651,325,600,895,443,931,311,807,817,581,587,342,736,394,355,416,624,790,803,862,707,393,325,542,643,878,450,527,724,411,477,672,781,496,757,475,425,719,671,762,530,359,881,852,675,463,346,805,800,489,481,401,422,688,435,874,340,920,788,392,733,829,745,694,374,931,939,534]
["Toyota Cami",494,771,445,630,719,493,516,836,927,513,549,906,780,705,633,577,513,931,454,540,366,416,865,667,638,641,885,722,642,563,366,476,403,783,621,543,323,894,743,663,319,414,733,529,582,865,359,568,862,355,917,340,603,562,372,340,927,562,357,602,937,805,864,856,803,945,652,941,508,854,723,535,546,929,453,401,703,818,949,855,723,633,620,373]
["Toyota Camry",727,692,623,774,455,506,567,581,453,946,714,650,330,735,571,798,448,594,858,619,752,580,419,745,465,326,306,340,931,449,628,538,529,529,890,700,541,911,539,353,400,812,572,869,799,649,823,597,718,800,489,635,405,769,314,905,524,385,893,894,918,303,668,388,577,331,508,940,563,307,793,543,753,926,558,728,527,716,839,439,513,948,612,314]
["Toyota Camry Gracia",633,333,737,364,699,943,428,773,901,738,754,707,733,655,735,512,608,460,898,855,726,918,469,424,707,773,358,347,799,935,695,897,560,521,411,350,916,892,399,910,764,393,425,387,587,411,837,325,430,771,871,652,886,689,640,378,949,903,842,818,681,435,907,600,943,507,474,626,800,855,872,516,874,576,794,480,522,620,451,667,644,396,828,903]
["Toyota Camry Hybrid",756,942,802,554,691,486,714,770,480,382,799,847,462,623,506,844,422,437,696,792,932,631,582,302,702,411,707,559,326,861,906,408,372,397,801,895,732,832,923,682,378,492,370,470,638,818,575,633,464,705,447,325,587,785,762,372,611,645,827,512,318,311,504,543,427,791,443,342,363,636,857,720,436,583,822,435,543,448,832,650,610,509,639,459]
["Toyota Carib",556,726,558,441,585,588,943,889,592,312,714,345,477,541,439,319,509,334,341,524,466,585,773,888,633,504,352,516,725,832,821,779,705,616,596,609,421,357,917,920,831,483,805,364,325,394,592,764,671,884,583,714,593,793,469,411,798,709,345,917,667,453,769,451,683,786,655,494,626,353,750,598,331,515,378,500,607,868,646,814,404,723,510,501]
["Toyota Carina",508,365,449,541,354,673,490,939,886,401,524,524,945,881,907,494,385,467,439,744,391,457,743,746,660,611,907,795,304,946,505,560,424,816,302,509,889,412,568,505,518,705,781,760,350,470,689,677,354,384,315,607,550,703,768,767,385,890,599,499,856,662,930,359,361,348,606,882,343,798,843,794,891,801,739,862,414,628,430,767,340,350,683,379]
["Toyota Carina E",788,439,806,568,655,690,564,610,765,313,462,415,788,393,941,722,352,588,352,603,847,795,380,323,875,708,356,576,826,701,904,524,659,488,485,866,900,393,451,691,696,450,436,836,317,746,615,469,846,412,901,591,919,564,859,654,305,551,723,862,344,648,341,534,948,400,508,729,888,480,536,577,941,578,928,819,342,646,312,709,495,847,718,535]
["Toyota Carina ED",828,653,440,358,411,406,392,742,818,740,483,876,719,460,365,444,947,590,422,848,446,865,606,805,505,798,816,572,908,334,425,687,936,830,435,589,471,667,700,824,505,465,525,549,536,602,893,937,524,623,426,596,455,589,455,818,442,836,865,371,656,488,571,369,583,828,773,644,343,588,876,893,540,546,792,763,799,630,416,399,627,379,324,482]
["Toyota Carina II",404,361,608,707,760,592,777,477,360,442,901,851,949,362,777,653,510,628,690,827,751,598,340,772,667,787,530,516,555,472,813,492,452,568,350,589,741,398,410,677,664,620,616,815,431,636,663,670,864,419,623,492,889,325,519,565,946,359,508,366,657,476,649,940,599,447,751,303,439,327,750,905,606,837,783,941,778,567,634,333,910,502,351,826]
["Toyota Cavalier",911,812,342,577,644,547,452,314,598,459,891,413,802,901,926,582,909,382,659,826,406,807,556,447,819,950,773,830,673,654,939,557,736,605,404,920,715,637,728,448,638,563,510,305,836,312,581,401,596,810,518,699,884,376,457,477,699,902,703,458,679,561,710,685,864,851,368,341,533,489,729,847,380,551,620,569,785,317,632,403,913,876,526,582]
["Toyota Celica",494,471,748,706,932,343,621,634,376,442,416,822,461,857,322,664,534,872,721,430,943,719,398,507,898,468,663,939,727,489,841,420,380,483,747,508,940,733,421,778,618,703,473,820,938,300,706,814,762,523,542,904,701,308,856,780,879,553,407,873,893,720,476,326,704,927,680,601,362,633,763,667,662,915,769,334,732,505,766,604,903,553,400,333]
["Toyota Celica Camry",844,471,493,576,528,593,732,905,927,526,467,656,711,480,562,500,918,534,792,906,838,849,523,938,393,411,304,874,307,542,598,602,511,883,666,869,746,351,939,950,306,781,848,670,431,522,625,423,638,428,566,913,440,509,375,588,403,699,730,801,775,521,949,710,898,693,652,304,426,619,582,493,431,903,573,691,467,942,718,665,421,628,521,661]
["Toyota Celica Supra",307,356,882,698,823,354,425,568,352,616,766,610,898,729,521,669,501,465,849,344,911,807,829,424,313,564,423,776,453,387,747,573,787,512,857,905,592,320,815,607,813,496,669,699,701,655,732,483,310,638,711,718,523,873,785,429,613,409,333,715,809,366,839,607,600,469,504,751,694,763,788,527,607,532,620,581,595,945,474,824,748,537,601,864]
["Toyota Celsior",877,350,503,418,918,891,459,455,729,659,324,619,924,880,938,759,709,806,861,408,403,947,377,847,769,868,804,836,891,500,496,317,659,432,821,371,426,670,946,664,427,549,527,306,786,599,482,812,875,456,776,661,340,615,628,597,396,544,456,357,436,469,934,645,775,367,930,628,636,753,487,758,837,916,672,620,707,398,858,416,492,331,443,361]
["Toyota Century",396,662,886,397,773,431,614,412,761,360,424,857,941,368,343,684,408,596,570,703,399,895,445,422,459,613,682,483,772,559,601,792,490,571,785,506,758,627,363,600,761,400,378,730,742,825,856,859,696,865,450,470,387,600,855,687,775,329,818,722,821,764,709,651,413,715,813,547,603,852,820,301,489,618,630,656,506,907,840,615,938,507,815,511]
["Toyota Chaser",867,823,791,309,760,500,719,417,716,758,580,308,565,507,495,426,579,473,454,629,514,920,541,887,813,868,315,823,324,446,794,404,754,476,476,400,863,785,547,614,397,588,863,912,494,612,732,504,644,851,351,436,573,801,392,761,572,524,907,909,564,666,915,399,596,371,661,930,480,340,728,736,460,615,402,408,895,942,748,594,355,420,768,745]
["Toyota Corolla",311,510,804,777,819,538,793,785,815,339,519,450,855,572,590,381,876,745,862,661,588,503,861,460,546,466,938,558,900,587,810,548,304,795,358,814,778,906,819,703,436,931,785,910,546,699,841,695,527,813,708,413,592,464,534,898,799,621,447,720,515,756,558,669,580,366,594,564,388,816,936,836,575,786,740,563,361,400,512,427,461,475,762,867]
["Toyota Corolla Axio",386,780,304,395,796,422,437,477,849,790,739,813,765,562,863,410,585,617,818,365,522,730,378,544,474,884,763,393,885,498,860,424,737,835,565,303,690,815,588,750,791,362,592,537,633,408,912,548,685,668,875,774,696,784,925,711,857,545,469,677,592,826,835,659,593,471,660,509,800,514,839,357,426,716,623,670,356,519,593,378,857,691,616,850]
["Toyota Corolla Ceres",830,821,930,304,798,950,688,348,733,593,384,659,699,552,796,317,714,605,315,536,765,370,405,306,633,466,798,415,732,827,376,462,499,521,588,334,375,667,539,714,779,864,319,474,374,579,454,690,349,495,611,305,773,484,843,338,439,899,733,430,596,906,892,760,887,549,650,815,342,328,577,498,854,678,774,730,796,906,897,656,799,723,618,718]
["Toyota Corolla Fielder",919,339,703,545,829,354,492,919,440,757,526,517,602,554,882,380,836,391,859,361,659,761,352,436,611,454,343,899,396,870,567,865,878,926,487,848,734,633,740,619,931,675,687,633,811,430,741,669,366,800,793,560,869,894,877,830,315,404,945,446,656,735,620,714,889,331,314,326,811,662,328,431,942,798,414,502,363,564,734,591,654,456,388,697]
["Toyota Corolla FX",866,858,415,947,793,459,629,379,301,927,892,903,514,525,492,621,372,373,375,619,646,692,795,549,462,899,948,356,321,398,876,485,405,554,539,631,701,602,702,541,608,750,435,342,399,877,903,843,692,750,401,656,491,668,639,868,946,913,348,760,645,717,690,726,571,797,405,769,773,723,706,849,408,578,898,304,901,770,552,871,881,498,487,613]
["Toyota Corolla II",700,344,642,515,834,388,805,594,452,777,563,370,772,465,487,850,522,623,502,415,335,911,388,351,876,476,363,864,696,578,722,816,345,429,441,908,569,469,821,337,726,901,372,569,780,658,877,631,843,543,452,332,670,446,534,756,856,439,638,926,512,899,304,639,739,304,720,426,882,710,665,716,399,355,321,788,435,864,337,722,476,773,592,389]
["Toyota Corolla Levin",711,745,459,846,486,723,397,661,896,490,436,610,789,410,925,609,538,479,694,503,382,389,359,919,672,770,946,925,750,352,774,513,853,779,679,523,611,678,384,504,647,466,508,827,759,438,892,308,560,587,433,735,416,688,824,725,594,792,675,574,752,657,922,678,565,894,663,681,391,648,778,340,435,652,818,544,350,794,565,888,658,477,327,410]
["Toyota Corolla Rumio",941,671,544,645,915,323,493,686,566,300,882,903,829,526,875,416,829,614,553,645,306,628,312,812,842,341,725,717,729,585,787,368,706,661,908,339,860,680,807,801,444,697,866,317,842,593,310,786,583,547,320,814,323,590,831,912,337,530,382,466,341,770,904,428,533,675,833,608,491,639,855,830,574,722,668,389,614,846,639,409,723,659,358,616]
["Toyota nCorolla Spacio",368,336,555,794,852,790,557,567,320,573,373,942,460,543,414,748,314,747,692,781,891,363,666,418,945,768,684,366,717,563,842,475,566,689,516,637,443,858,886,706,870,517,454,415,842,375,581,786,635,819,766,313,387,936,758,324,946,877,410,687,832,681,700,488,730,930,651,646,568,709,847,315,932,321,656,345,928,688,393,614,917,668,501,792]
["Toyota Corolla Verso",483,859,521,560,442,783,529,344,622,477,474,538,844,721,642,792,490,759,631,938,725,706,608,594,827,651,705,790,720,695,700,575,536,772,692,312,495,511,901,751,711,315,377,857,715,483,659,385,317,564,337,497,680,940,835,864,675,417,344,864,590,321,916,852,834,507,362,930,572,537,432,722,616,753,816,563,399,760,482,474,399,537,503,849]
["Toyota Corona",610,451,670,316,518,795,667,350,857,702,761,746,314,771,331,851,643,588,433,553,746,630,881,525,370,582,344,665,677,564,871,789,694,535,900,736,335,444,434,720,575,300,342,816,331,581,932,545,305,404,736,345,591,604,934,535,873,553,743,780,536,911,724,554,593,342,436,322,733,897,798,306,914,532,456,881,710,919,723,598,338,367,855,448]
["Toyota Corona Coupe",595,726,844,489,654,413,579,446,452,309,658,588,424,473,321,623,529,685,410,569,520,620,840,699,472,378,870,770,580,334,617,854,561,415,893,511,872,330,535,540,556,484,425,767,487,726,885,950,353,533,641,559,789,433,883,938,924,396,304,322,362,422,921,911,660,347,772,446,829,544,711,315,425,437,426,330,660,736,843,892,397,771,614,848]
["Toyota Corona EXiV",386,532,937,790,863,511,796,666,311,752,565,651,402,910,533,867,853,855,419,894,348,594,761,491,415,421,436,639,679,944,384,429,517,932,859,342,849,866,415,840,720,319,517,737,812,554,381,696,822,756,594,572,919,937,745,559,691,840,734,326,635,585,740,605,888,555,854,844,752,856,597,516,665,784,644,595,788,677,718,619,634,607,805,740]
["Toyota Corsa",436,371,903,436,693,763,701,729,679,704,546,404,933,799,697,815,786,611,572,327,536,388,661,380,366,382,403,850,785,485,544,685,714,385,768,784,675,598,903,393,617,543,452,819,935,751,920,306,616,613,387,354,756,869,748,936,803,844,390,523,716,538,427,417,707,909,487,581,911,842,801,601,799,902,465,712,846,562,932,744,730,743,938,709]
["Toyota Cressida",412,906,670,753,555,937,305,814,568,700,925,520,486,412,392,377,610,814,462,448,411,408,681,837,937,491,696,571,325,639,723,800,641,791,658,331,352,591,633,387,370,759,555,504,477,812,890,561,435,762,441,715,802,775,835,703,627,754,583,300,636,388,577,677,593,424,811,588,388,939,406,553,772,941,924,605,419,934,448,777,475,662,527,658]
["Toyota Cresta",721,356,562,380,784,871,516,735,441,737,532,657,371,817,505,435,484,600,840,320,684,400,406,884,325,695,659,426,659,794,768,392,472,629,518,701,836,547,826,730,761,342,927,903,813,523,370,499,937,617,780,355,541,320,742,563,628,929,623,943,681,916,570,724,610,736,607,435,336,429,432,734,799,543,893,638,507,703,793,942,404,734,927,768]
["Toyota Crown",916,396,375,839,311,311,704,679,753,590,611,798,647,335,786,874,620,434,845,747,851,665,874,793,740,948,764,523,304,756,336,481,876,696,862,537,490,414,312,490,331,649,540,913,704,673,602,551,884,313,795,850,468,405,541,361,949,349,940,507,838,461,594,414,853,304,566,816,386,674,649,642,393,836,398,442,687,560,417,491,465,689,462,880]
["Toyota Crown Comfort",327,523,775,947,780,847,319,923,937,608,557,311,879,398,375,755,689,378,741,642,378,574,643,560,435,526,382,303,742,837,528,901,306,652,722,555,616,762,330,665,688,821,358,754,925,888,394,811,474,502,858,872,788,550,903,775,468,611,689,534,535,470,581,613,341,702,695,665,453,335,441,513,756,406,502,924,852,448,431,823,920,478,943,323]
["Toyota Crown Estate",845,481,389,321,610,568,788,375,304,759,363,690,333,317,386,857,457,882,579,410,619,801,826,820,400,557,836,557,726,444,675,576,596,311,817,914,943,301,603,893,457,754,437,651,583,860,727,635,873,329,872,746,622,638,476,876,625,655,663,950,802,580,898,375,941,548,945,655,752,550,647,623,838,763,782,445,547,449,787,519,492,372,928,319]
["Toyota Crown Hybrid",549,631,858,565,760,388,528,459,494,442,300,452,850,692,331,597,835,378,419,484,345,938,889,630,691,403,909,916,720,821,431,481,950,518,479,702,863,872,909,563,460,796,434,701,771,676,923,403,356,750,943,682,519,850,840,670,849,692,756,831,508,756,388,799,627,454,437,862,413,886,580,775,415,898,647,906,708,308,870,538,510,611,574,911]
["Toyota Crown Majesta",678,788,435,444,572,412,687,903,822,426,717,412,710,305,887,543,403,467,631,405,453,436,897,408,825,880,901,632,362,378,845,867,726,329,719,751,768,597,484,319,638,439,613,535,513,306,761,703,931,923,753,317,346,844,795,612,582,527,702,658,439,400,725,709,562,307,361,796,931,365,579,544,521,797,763,309,468,346,760,625,665,324,567,486]
["Toyota Crown Wagon",894,597,367,773,728,583,826,556,413,325,682,355,477,471,400,490,579,482,642,413,415,612,592,603,817,838,438,933,738,412,590,781,833,584,673,435,559,499,665,465,799,843,313,473,521,566,622,437,340,736,705,928,667,549,301,404,806,326,680,525,855,561,653,399,377,311,566,865,312,590,930,909,641,899,849,525,369,587,678,454,844,720,878,914]
["Toyota Curren",427,693,833,301,440,369,856,775,361,358,888,517,586,572,699,906,823,857,927,479,708,932,922,497,932,724,827,896,505,685,909,909,632,708,366,484,455,705,582,797,764,353,352,512,306,429,379,648,907,476,425,862,553,610,863,631,390,857,757,762,536,412,911,918,810,488,819,636,740,871,693,552,420,719,754,409,346,691,391,445,845,941,317,889]
["Toyota Cynos",312,775,831,392,782,798,405,464,550,932,551,844,450,520,821,583,769,347,713,945,388,570,605,698,747,922,623,462,761,882,330,706,533,731,348,460,496,523,721,391,335,904,421,620,687,709,800,606,393,359,500,838,337,761,353,309,860,340,632,594,944,552,397,569,945,835,366,502,426,645,353,760,369,558,503,918,755,422,475,698,663,656,832,746]
["Toyota Duet",368,346,847,854,665,753,909,768,683,492,840,752,821,398,580,813,806,469,300,915,699,535,764,802,653,592,801,351,541,347,641,501,720,871,477,442,531,524,562,688,611,440,820,350,429,498,580,636,578,723,766,705,316,780,941,611,402,709,683,512,622,769,545,422,584,876,553,544,871,551,929,723,530,394,701,435,903,519,551,931,719,538,443,716]
["Toyota Dyna",820,481,831,869,646,587,740,702,752,334,853,392,696,335,469,677,652,722,714,386,312,841,300,764,619,712,498,720,388,625,893,382,573,384,648,436,725,772,930,440,925,318,814,374,536,756,855,446,905,532,517,805,674,303,350,627,460,718,318,518,321,814,349,846,437,478,317,553,877,419,640,453,830,379,778,511,317,349,928,313,620,560,711,326]
["Toyota Echo",398,320,815,355,881,322,408,516,441,324,595,905,456,514,765,380,482,348,751,500,820,423,929,697,405,442,890,528,806,349,684,773,873,452,534,936,748,562,556,345,444,435,585,440,922,714,603,306,827,729,440,470,330,520,621,782,862,356,364,481,383,419,661,854,329,412,711,940,912,538,544,623,883,486,764,693,327,850,716,753,893,316,940,637]
["Toyota Estima",576,898,776,524,332,413,629,711,435,450,669,506,950,823,472,322,829,644,436,681,553,550,307,500,413,789,463,764,918,752,310,549,865,651,873,622,478,714,696,944,734,929,312,770,789,529,934,660,304,508,629,827,660,721,945,874,701,524,392,468,877,663,324,826,663,811,368,797,685,613,303,356,449,941,541,343,337,783,519,462,379,399,814,763]
["Toyota Estima Lucida",836,496,892,414,696,347,855,793,573,811,868,651,356,566,513,447,872,367,750,410,490,510,447,696,371,657,319,393,791,525,409,413,650,807,824,440,509,684,558,319,751,716,852,801,563,578,491,563,603,398,516,794,309,446,822,935,409,584,572,839,651,388,948,917,617,828,346,308,385,905,920,400,510,771,547,423,450,393,924,581,423,540,551,675]
["Toyota Exiv",721,648,606,567,755,707,304,673,949,909,518,721,464,835,500,578,550,595,497,901,718,303,899,615,324,926,396,754,550,372,764,793,704,844,362,515,719,684,930,834,761,885,867,772,429,799,433,489,620,643,669,843,924,836,715,414,515,763,940,876,617,698,741,331,300,723,459,700,664,720,561,927,781,478,796,630,871,470,504,826,453,839,715,384]
["Toyota FJ Cruiser",410,694,628,389,824,837,936,745,538,778,892,466,885,401,385,843,463,466,347,328,541,588,948,915,587,629,480,826,812,716,645,419,572,666,565,888,616,465,438,434,632,875,718,648,881,695,405,517,759,662,871,352,766,534,416,365,740,497,719,697,670,557,670,897,559,418,399,752,909,610,540,737,414,413,704,678,942,577,858,536,453,538,930,914]
["Toyota Fortuner",425,494,625,709,378,907,572,383,680,588,405,593,509,325,365,704,851,643,707,835,936,908,741,944,400,588,359,789,884,782,534,821,604,712,823,611,893,829,439,773,595,413,497,312,388,709,803,857,571,393,903,625,302,490,334,635,744,419,778,943,558,653,847,932,443,326,712,494,545,842,622,881,557,380,322,380,302,395,304,467,716,329,722,499]
["Toyota Funcargo",687,918,926,641,387,491,891,728,331,505,847,596,787,757,349,316,890,581,860,833,389,734,857,726,759,630,760,470,670,557,505,827,675,822,595,591,821,844,531,883,364,320,848,836,639,332,621,711,352,875,519,693,382,401,855,318,718,734,920,869,823,549,828,314,890,639,853,879,618,488,736,818,513,686,483,898,927,595,882,634,610,794,751,575]
["Toyota Gaia",350,599,672,934,718,628,700,711,747,513,762,851,927,802,308,811,322,904,824,659,723,492,813,690,617,803,719,498,706,323,571,620,721,577,310,875,844,582,356,711,505,710,632,605,535,833,343,337,522,863,382,515,949,929,892,763,767,693,460,462,842,827,673,824,925,317,310,678,543,502,412,578,402,338,893,501,768,375,628,749,401,559,525,331]
["Toyota Granvia",589,825,738,915,572,335,500,759,934,903,459,444,458,517,921,502,364,680,831,373,944,640,786,709,335,324,361,800,770,565,780,659,833,440,879,603,303,355,766,478,406,361,450,855,656,788,895,611,431,825,451,686,628,540,365,616,325,311,345,578,948,527,664,450,421,909,359,921,428,534,481,538,803,426,856,385,429,611,744,937,561,505,659,712]
["Toyota GT86",695,461,333,825,578,734,499,908,859,836,843,809,409,767,891,589,937,874,303,408,529,435,395,450,477,810,836,782,897,913,333,359,317,757,722,510,663,791,576,682,348,575,736,524,416,619,481,798,623,745,687,441,497,848,587,406,359,873,918,739,554,305,784,689,663,911,615,822,616,362,368,942,613,327,562,939,810,892,786,308,417,426,857,761]
["Toyota Harrier",617,914,512,443,695,891,583,606,700,616,442,810,714,336,681,932,549,918,484,827,342,441,579,941,694,890,658,515,454,590,393,907,757,528,624,524,647,494,383,561,898,410,822,352,748,665,557,556,937,633,463,903,490,719,788,712,802,591,938,585,791,841,668,326,536,947,362,422,618,640,949,656,764,569,924,787,912,893,859,821,903,880,493,367]
["Toyota HiAce",627,450,886,768,646,352,631,620,529,311,677,358,818,571,518,436,587,441,385,743,673,570,934,732,390,641,948,428,637,603,650,523,559,384,434,473,644,429,533,782,399,909,520,875,502,327,341,702,570,815,700,555,617,884,815,930,707,615,621,317,504,649,384,861,861,827,322,682,929,783,382,469,515,502,774,536,874,882,527,859,362,753,354,647]
["Toyota Hiace Truck",849,820,540,370,829,850,820,898,367,340,536,807,929,649,358,448,318,903,813,529,624,321,338,658,423,680,468,918,849,664,316,765,329,943,757,614,859,348,946,337,447,367,845,808,501,814,364,491,338,785,710,348,579,927,479,746,707,935,938,885,888,908,446,690,456,635,388,781,544,336,403,689,833,505,632,372,456,499,657,572,880,814,873,894]
["Toyota Highlander",921,919,329,919,853,762,575,760,328,319,554,593,373,439,873,661,571,398,374,580,642,302,859,947,763,372,733,442,523,509,584,927,554,318,842,324,426,581,590,518,385,917,454,460,816,404,454,364,490,505,745,543,739,724,354,669,796,702,355,736,718,867,524,646,770,337,534,495,454,384,353,348,383,696,694,928,441,812,764,692,782,828,880,568]
["Toyota Highlander Hybrid",811,663,742,639,573,641,620,525,694,568,392,453,589,518,872,805,945,537,525,919,605,360,821,815,318,635,699,908,453,946,440,441,476,592,373,716,827,391,562,631,690,367,862,433,861,725,772,910,796,598,665,804,410,905,884,766,769,382,599,913,552,476,495,599,852,925,804,414,950,928,805,945,688,818,637,344,680,826,619,834,791,359,928,315]
["Toyota Hilux",810,465,632,362,829,307,595,691,925,572,726,429,689,509,769,629,883,395,653,574,926,568,330,430,500,850,599,760,532,793,825,606,471,492,706,521,730,902,490,926,454,721,923,423,394,562,429,840,516,459,814,494,673,404,730,454,332,612,868,698,340,717,668,465,866,663,831,304,825,896,529,664,914,711,752,527,536,531,398,468,616,789,607,838]
["Toyota Hilux Surf",598,388,335,918,900,715,482,595,805,768,463,627,826,606,902,805,943,313,389,868,919,686,923,510,815,868,609,521,661,871,676,482,335,847,398,438,647,936,740,398,792,360,324,601,373,856,357,813,831,623,740,650,821,304,556,946,804,538,908,457,338,663,797,510,723,436,915,833,375,571,561,451,626,547,750,947,891,808,802,478,632,495,613,869]
["Toyota Ipsum",599,841,738,925,558,656,531,500,497,666,529,825,941,419,870,487,497,583,920,559,900,670,362,828,703,449,636,430,886,341,402,625,382,640,466,453,435,835,819,761,504,722,815,474,400,477,567,724,689,393,867,384,777,431,378,318,688,440,300,733,787,368,934,735,300,377,745,718,660,361,503,850,937,911,407,862,881,412,604,916,304,923,551,359]
["Toyota iQ",892,883,391,905,900,498,732,911,769,450,928,853,600,559,637,804,770,847,776,751,330,382,416,529,899,807,337,861,930,539,455,585,556,480,676,642,702,433,578,375,735,474,944,527,852,418,555,561,504,568,832,650,644,860,901,762,888,749,327,449,819,713,680,331,342,770,579,650,840,361,634,706,782,943,601,898,688,733,928,615,559,546,353,340]
["Toyota Isis",861,476,680,625,685,463,889,895,462,462,304,785,608,508,391,339,596,672,469,748,548,820,494,591,919,350,705,827,640,570,739,914,430,781,626,700,329,789,801,357,730,526,594,601,881,519,693,779,925,565,599,418,446,659,890,723,911,805,338,907,659,524,743,729,316,949,936,640,691,581,445,534,903,485,824,359,713,610,434,479,819,437,495,334]
["Toyota ist",440,811,559,430,929,751,782,553,514,438,779,644,396,483,431,769,398,558,641,695,537,683,833,541,335,414,870,532,444,382,515,412,305,320,424,808,830,802,898,617,887,778,426,673,817,343,348,300,705,425,861,391,485,747,403,726,317,532,891,469,303,657,443,444,590,498,736,692,498,813,310,618,353,743,885,948,775,487,644,345,530,930,584,726]
["Toyota Kluger",494,487,756,902,557,929,535,809,863,455,365,549,372,642,937,732,530,707,625,723,646,400,736,651,469,863,723,532,460,756,905,872,791,731,817,945,619,822,480,346,719,376,782,795,838,306,769,849,929,884,919,703,360,528,948,306,906,475,842,947,541,884,425,731,536,322,318,949,777,809,666,811,508,332,684,301,422,617,794,764,492,531,636,327]
["Toyota Land Cruiser",882,591,862,754,303,589,635,736,860,513,330,387,642,857,574,392,535,805,387,944,434,697,913,429,595,485,400,604,756,693,638,500,811,584,824,581,885,841,856,711,840,426,750,390,945,345,796,569,602,667,413,942,554,743,921,530,706,653,896,869,558,934,400,579,919,496,602,859,772,749,872,695,667,464,451,689,326,337,914,879,475,947,429,707]
["Toyota Land Cruiser Prado",918,326,857,765,701,457,635,331,790,393,912,458,471,860,818,921,667,700,594,413,580,735,615,695,607,934,782,769,753,928,530,531,793,610,906,723,788,388,833,866,350,462,709,504,694,918,848,642,807,739,932,770,385,417,736,523,917,668,930,816,608,921,878,365,399,445,357,763,746,480,842,602,479,650,530,381,753,492,327,881,614,406,491,322]
["Toyota Lite Ace",373,582,665,317,588,347,943,403,886,616,892,920,460,602,504,825,357,875,496,401,594,304,487,554,842,527,948,664,747,599,460,804,374,548,381,597,460,701,323,836,894,886,335,742,365,450,601,652,679,898,514,363,832,942,548,561,596,893,593,694,509,548,491,779,827,854,827,879,662,807,752,930,747,530,608,559,698,603,787,924,786,415,376,603]
["Toyota Lite Ace Noah",342,891,448,332,508,397,858,333,895,699,429,743,638,577,916,406,912,623,397,440,648,584,770,586,927,567,771,585,768,316,313,350,725,620,634,499,867,593,679,747,575,340,917,832,335,371,724,557,798,472,701,568,773,943,633,692,433,900,932,613,373,440,512,316,692,380,307,742,526,323,744,746,560,868,858,501,846,552,709,631,390,589,587,399]
["Toyota Mark II",353,410,778,821,915,657,490,622,537,573,873,325,900,714,801,831,509,482,675,665,568,747,490,379,908,781,690,322,542,929,933,402,891,702,875,407,893,514,445,540,369,542,608,722,749,700,505,562,343,358,689,838,303,565,497,815,644,846,938,820,808,507,761,792,339,940,831,606,378,715,344,378,687,457,886,306,304,516,679,547,800,817,333,425]
["Toyota Mark II Blit",324,888,779,476,558,388,772,528,591,335,772,649,517,380,556,506,512,678,862,846,363,370,537,837,673,734,464,719,710,436,597,411,856,680,422,710,795,649,683,302,720,608,372,739,464,503,893,412,865,681,495,790,648,939,940,648,630,445,503,537,348,670,428,622,778,617,719,301,584,908,585,936,780,354,398,648,543,649,432,438,421,938,788,409]
["Toyota Mark II Qualis",723,765,445,370,949,793,480,683,946,506,437,320,575,515,757,467,577,353,868,611,828,798,781,615,927,822,594,619,551,635,300,522,339,689,642,898,360,681,584,338,891,794,643,764,500,815,524,911,337,423,450,335,558,566,887,383,620,381,928,572,484,870,793,874,931,525,853,949,632,855,792,405,365,941,836,852,593,705,360,888,851,572,693,776]
["Toyota Mark X",749,488,303,663,699,944,727,521,566,409,305,301,584,801,388,730,843,868,447,937,459,813,431,657,624,312,584,839,336,583,328,691,391,454,907,826,868,451,857,446,848,596,677,615,897,834,872,381,491,797,785,409,854,587,426,311,849,674,357,753,789,849,886,702,740,382,320,719,599,859,645,834,325,874,829,929,597,752,649,478,346,898,513,372]
["Toyota Mark X ZiO",453,783,573,480,834,469,752,417,836,324,382,393,312,460,428,787,465,826,524,333,585,897,572,784,517,867,508,759,536,795,509,836,607,928,681,560,339,381,307,371,507,509,491,618,604,581,529,487,366,833,528,915,584,536,841,327,949,904,832,412,406,875,448,541,588,489,422,674,585,909,651,883,417,808,602,937,740,921,419,592,914,506,942,642]
["Toyota Master Ace Surf",705,406,509,603,552,582,711,914,849,330,839,744,715,641,625,553,904,344,390,467,772,376,378,582,769,521,782,336,308,604,605,600,693,886,364,510,679,398,734,852,729,432,881,442,397,684,733,873,714,317,738,480,314,381,462,336,830,741,476,711,950,538,369,671,685,448,918,616,652,485,342,689,514,357,856,813,732,909,748,527,642,642,795,510]
["Toyota Matrix",306,932,701,924,810,611,495,490,305,339,690,663,814,857,830,559,924,744,911,710,495,865,843,337,926,921,826,911,310,494,358,823,506,542,720,869,363,551,751,906,754,547,506,816,383,543,936,304,426,726,501,656,924,352,798,512,532,414,352,606,796,466,632,883,725,442,421,375,748,569,528,546,783,904,641,520,936,689,653,939,528,460,451,947]
["Toyota Mega Cruiser",315,433,796,839,813,751,364,775,486,676,941,519,554,915,726,407,384,482,615,378,900,665,723,868,928,770,403,800,949,726,794,872,949,792,918,794,398,422,936,354,947,453,927,584,352,313,409,795,369,799,859,506,704,595,543,459,542,552,508,436,648,899,534,462,787,406,629,424,898,810,434,672,634,728,827,830,304,575,887,366,622,714,532,671]
["Toyota MR2",311,372,807,663,949,437,523,763,362,446,616,473,339,669,393,335,655,765,810,562,649,420,468,932,887,309,320,628,936,565,388,324,641,823,346,803,593,797,531,339,413,329,493,835,326,835,487,780,324,870,900,878,363,337,428,524,397,933,873,847,856,388,506,771,602,609,707,684,410,759,864,402,594,918,915,536,503,430,901,880,456,867,914,523]
["Toyota MR-S",765,448,807,633,638,565,922,910,830,451,651,456,860,706,893,450,876,710,798,811,387,747,738,673,826,356,940,713,444,823,913,369,352,565,585,944,331,336,915,341,730,848,789,456,467,854,876,563,893,541,883,606,745,934,398,437,417,799,485,748,703,852,434,735,366,796,711,820,740,773,710,584,611,510,495,546,583,625,920,848,359,759,884,623]
["Toyota Nadia",645,368,484,821,331,491,922,789,873,702,882,664,864,518,413,374,409,610,885,930,574,710,911,794,455,507,858,852,540,774,715,591,313,739,314,808,889,824,726,521,360,752,390,392,629,440,835,505,697,753,639,359,406,938,361,829,844,550,839,608,302,390,324,316,910,415,759,342,795,440,628,454,774,584,650,593,639,300,555,764,898,541,714,488]
["Toyota Noah",689,564,364,430,729,663,348,492,386,620,378,799,547,894,563,747,389,772,715,919,807,880,873,304,361,535,558,384,663,750,918,749,711,597,758,810,560,564,926,373,690,425,734,304,470,587,895,698,534,333,683,817,406,913,644,714,334,858,390,543,616,797,611,741,477,940,327,532,358,510,492,691,598,693,410,555,600,607,639,417,586,323,318,781]
["Toyota Opa",330,392,612,325,658,659,819,490,618,860,328,906,541,355,918,879,479,692,872,928,647,524,815,672,337,455,819,509,444,863,800,895,790,686,406,501,698,499,752,514,846,774,783,695,444,694,897,503,758,612,658,804,348,434,748,679,583,728,535,501,547,864,515,869,481,685,760,869,404,643,449,337,783,607,552,378,754,302,827,882,639,786,456,840]
["Toyota Paseo",650,440,805,372,573,389,664,915,491,652,360,591,640,769,622,701,484,601,352,641,447,522,402,339,301,881,385,378,936,375,802,810,337,511,701,498,302,939,615,317,754,945,310,358,521,769,404,627,385,419,381,485,313,799,633,812,453,415,591,568,439,631,537,611,944,322,357,709,786,343,726,594,361,572,831,428,681,465,722,322,437,692,864,599]
["Toyota Passo",777,657,881,440,460,311,671,656,669,897,363,764,669,913,728,646,501,592,493,657,511,752,870,726,736,603,894,909,422,867,707,728,570,798,686,484,459,742,520,320,419,766,326,856,474,427,832,734,556,460,855,554,747,927,632,334,767,379,849,747,526,689,494,896,570,372,386,631,544,695,714,398,571,455,538,502,901,608,905,670,768,534,766,813]
["Toyota Picnic",443,632,473,763,634,939,938,727,476,332,817,335,499,631,747,937,304,488,371,517,337,374,485,463,912,573,567,597,632,583,540,411,325,935,464,429,331,677,885,787,699,382,301,700,736,712,750,452,650,554,390,494,524,315,521,932,785,568,683,551,896,417,663,404,361,499,935,722,701,862,885,927,349,586,904,644,472,366,479,492,535,943,450,812]
["Toyota Platz",928,703,575,669,683,351,631,390,784,636,866,632,819,810,827,920,898,754,840,859,644,729,446,872,782,937,561,433,672,344,306,649,789,435,463,567,438,736,503,889,707,599,412,897,855,404,636,656,861,577,502,928,904,542,854,860,657,356,337,340,350,711,437,528,604,684,511,610,451,605,457,881,810,754,655,555,864,663,445,529,654,344,725,932]
["Toyota Porte",631,803,390,521,950,551,590,548,515,741,606,629,909,914,591,764,858,460,510,633,931,677,302,871,547,368,618,499,560,550,303,419,589,484,439,598,747,626,502,857,805,557,571,471,634,319,362,833,943,745,824,384,682,913,715,508,783,742,622,874,650,703,923,768,561,451,735,792,456,809,800,608,477,540,447,872,713,420,493,891,685,521,322,345]
["Toyota Premio",826,912,760,846,449,561,776,708,877,351,494,669,708,575,719,654,404,370,860,589,588,735,607,525,673,406,878,504,897,722,884,333,525,590,942,612,604,338,320,940,503,420,808,381,880,717,388,733,438,819,384,433,498,598,798,325,775,772,777,326,408,622,536,621,619,791,785,751,905,814,611,408,887,440,429,614,789,693,898,709,539,316,558,941]
["Toyota Previa",608,567,822,450,581,847,653,340,790,757,428,738,943,391,357,808,475,380,306,777,821,360,610,620,346,704,676,367,731,486,585,872,828,460,398,900,801,451,817,908,514,717,363,376,701,331,429,939,767,937,714,864,356,908,556,760,403,302,742,704,391,490,814,685,751,491,903,638,775,717,823,611,726,305,486,609,343,767,405,660,675,690,675,791]
["Toyota Prius",728,474,848,766,350,663,742,891,690,730,599,745,839,356,422,310,914,914,822,486,410,815,649,404,807,704,806,753,597,766,790,814,839,938,723,453,737,486,538,649,829,722,827,353,791,891,866,603,488,497,924,397,429,782,540,934,683,950,937,718,897,582,727,569,810,659,796,727,860,484,928,583,353,623,926,498,682,621,466,756,811,751,619,815]
["Toyota Prius Plug-in Hybrid",762,838,678,493,809,665,889,433,880,483,902,472,635,626,837,459,673,542,356,769,623,341,570,855,418,336,531,555,657,662,429,429,381,372,670,476,731,716,728,358,348,824,409,921,320,866,921,382,590,302,661,683,392,378,871,927,760,592,809,370,331,887,851,453,577,429,307,499,653,619,569,898,773,748,846,506,739,340,385,551,487,836,443,675]
["Toyota Prius V",343,897,896,362,780,643,916,408,406,373,837,849,692,362,581,307,451,519,751,853,679,478,603,507,784,784,531,431,307,769,713,875,934,879,643,413,560,912,595,591,449,826,483,862,710,309,460,664,815,912,335,623,432,662,931,522,371,699,801,822,703,944,904,331,681,622,380,937,401,430,604,494,877,807,439,772,324,407,889,431,428,694,699,799]
["Toyota Probox",519,660,929,792,431,797,793,761,907,580,428,608,602,489,681,919,300,853,398,404,321,309,426,949,448,722,309,374,318,835,392,359,749,560,937,626,412,351,504,840,606,466,795,798,640,754,632,451,575,454,326,384,411,738,603,659,491,331,337,841,942,482,482,428,702,389,576,338,693,946,647,649,946,437,380,457,936,677,538,431,876,679,358,914]
["Toyota Progres",742,623,736,858,465,874,492,691,310,933,735,562,449,527,499,353,883,572,439,362,907,598,541,507,300,309,813,860,707,622,802,529,535,432,757,605,679,587,324,723,567,679,486,384,410,390,896,429,562,899,779,376,870,902,370,740,826,474,650,492,881,430,877,704,701,724,589,804,881,453,490,885,691,865,375,540,590,385,652,552,691,855,484,321]
["Toyota Pronard",495,714,871,592,948,327,829,493,592,588,875,506,945,702,756,927,513,351,926,915,620,797,376,781,428,870,725,380,301,541,612,921,386,593,836,701,642,551,947,618,830,554,924,814,459,432,617,554,563,423,858,906,503,761,429,675,837,653,661,693,714,731,355,860,587,593,759,601,593,442,581,926,643,554,628,328,396,870,649,694,633,765,464,338]
["Toyota Publica",438,948,823,318,437,798,698,918,789,711,507,769,516,322,612,306,884,928,560,789,469,876,830,357,812,838,355,448,856,484,355,719,904,892,383,399,911,388,588,374,421,673,376,426,642,746,723,524,547,914,623,540,627,733,792,921,745,865,319,914,770,383,547,592,525,602,685,336,732,834,367,711,435,552,846,618,402,840,334,444,333,888,524,303]
["Toyota Ractis",560,914,455,815,643,613,505,502,754,328,346,499,461,692,569,526,627,775,395,437,796,494,520,810,830,392,877,340,646,761,488,468,679,547,867,317,475,818,635,401,551,715,900,646,318,559,666,789,433,511,594,467,351,832,352,444,747,670,763,751,569,602,548,381,924,528,523,471,836,587,678,649,603,592,794,757,766,438,588,867,674,537,897,700]
["Toyota RaumR",490,850,572,403,435,852,751,893,459,319,852,865,862,327,906,704,707,450,630,395,944,774,440,564,510,671,330,338,755,308,870,394,439,353,696,772,910,782,759,942,801,731,443,698,550,681,617,637,821,624,474,644,461,414,865,371,370,773,345,815,568,641,413,828,665,734,934,763,812,674,568,371,587,654,355,432,328,534,336,308,749,901,933,588]
["Toyota AV4",789,465,728,885,932,365,373,501,557,530,831,498,698,308,665,503,672,885,790,782,393,782,397,605,429,724,354,857,688,743,550,525,311,650,622,897,335,341,898,726,515,685,706,903,450,564,707,611,564,600,916,811,865,931,739,746,549,566,613,328,710,565,630,321,774,490,622,591,674,732,686,864,681,746,920,794,530,801,352,435,652,701,522,864]
["Toyota RAV4 EV",323,522,923,475,652,584,757,704,327,640,582,831,595,682,641,400,602,944,696,438,353,541,637,390,380,543,561,691,934,509,337,847,561,635,611,921,640,621,705,453,355,894,910,346,568,520,763,794,775,807,907,705,364,849,521,460,842,309,456,611,885,406,750,653,834,528,732,659,602,780,519,387,812,872,650,542,375,814,866,844,343,919,574,934]
["Toyota Regius",783,315,717,747,452,780,572,666,833,804,725,684,479,610,479,385,804,932,752,553,457,534,713,896,659,574,459,371,723,565,680,313,506,764,533,915,442,450,871,331,657,509,404,899,329,377,772,752,557,344,778,845,902,784,878,881,344,778,309,904,547,495,912,745,600,809,368,670,764,636,516,576,747,469,784,445,424,545,866,480,464,858,700,725]
["Toyota Regius Ace",487,706,602,830,408,637,706,456,674,532,422,880,410,454,889,383,892,883,923,690,824,534,444,375,356,925,601,692,541,432,332,772,567,442,830,569,670,921,631,917,666,686,641,318,613,606,486,520,394,334,779,801,402,797,754,703,556,745,310,672,784,468,399,457,715,856,893,912,377,354,592,550,594,782,685,899,582,637,421,371,631,940,395,493]
["Toyota Runx",741,510,913,626,644,348,900,459,757,359,949,919,532,828,522,442,817,646,686,357,791,800,712,824,481,743,723,666,579,804,342,578,577,416,333,409,811,311,519,889,527,803,810,441,675,680,770,823,931,586,514,599,681,437,864,639,395,620,726,727,511,689,708,669,948,312,696,433,794,819,649,870,728,946,941,321,738,433,771,428,473,676,459,763]
["Toyota Rush",834,711,806,895,508,776,845,737,308,392,930,871,683,712,585,339,311,558,472,437,597,354,339,716,668,322,415,532,536,753,770,419,490,413,778,569,551,409,766,621,381,304,500,593,695,560,905,632,772,481,566,364,328,904,817,776,671,527,946,498,766,759,675,408,609,892,862,680,416,541,693,862,653,872,717,561,721,413,770,620,657,916,560,486]
["Toyota Sai",551,748,698,780,855,895,948,761,766,852,418,904,685,784,432,847,816,496,451,629,443,415,766,545,934,939,772,584,678,776,948,862,316,697,689,836,717,527,770,506,585,867,555,582,710,647,463,537,846,462,868,481,754,612,348,627,505,837,375,737,532,801,301,767,668,538,722,936,390,655,314,687,386,944,317,460,812,512,794,759,907,892,301,858]
["Toyota Scepter",632,687,558,340,421,563,847,393,663,584,761,669,758,915,326,927,843,910,904,946,848,874,522,554,924,490,591,540,850,704,906,789,780,631,352,668,539,816,596,606,667,787,883,409,452,417,636,471,397,321,825,889,876,549,567,602,772,907,427,387,322,869,904,703,543,821,741,737,653,942,638,578,552,796,395,484,445,599,358,671,368,852,535,674]
["Toyota Sequoia",305,733,367,334,930,314,554,770,780,855,933,621,344,423,744,814,579,815,761,353,358,446,713,905,939,577,579,781,366,410,643,940,646,608,684,555,365,889,621,435,445,319,691,457,851,528,498,390,579,775,925,679,331,936,777,703,525,430,441,841,775,715,653,738,577,836,643,598,412,916,719,676,360,752,781,360,388,882,396,471,326,399,847,339]
["Toyota Sera",649,496,311,536,493,746,667,779,701,306,748,510,531,661,352,783,419,332,945,837,781,949,517,937,879,849,643,702,658,672,644,880,920,717,754,911,538,590,904,834,857,874,539,772,619,685,317,448,798,322,815,423,515,410,552,541,580,312,586,874,766,390,513,912,762,329,909,566,532,639,460,460,800,410,832,451,869,318,591,946,380,867,536,869]
["Toyota Sienna",714,941,868,918,592,339,888,368,940,393,831,425,396,917,592,304,583,472,904,518,830,617,562,469,709,399,480,374,587,631,539,878,486,515,451,319,771,582,444,444,439,449,486,813,729,740,380,505,464,940,407,838,832,756,366,440,803,336,403,727,753,363,847,617,340,892,848,860,790,531,876,823,886,349,627,515,623,550,938,744,680,511,760,421]
["Toyota Sienta",643,928,434,417,714,400,441,461,433,837,792,403,463,623,536,561,583,804,677,940,486,802,896,357,544,630,675,324,353,610,330,601,825,399,550,393,549,808,867,672,832,527,317,378,749,483,323,779,432,362,899,467,429,845,494,862,648,619,894,445,329,588,386,431,414,501,562,493,715,855,645,899,666,411,527,715,745,824,571,443,875,760,545,936]
["Toyota Soarer",820,368,796,939,486,370,494,356,303,561,894,457,893,776,838,797,459,467,419,400,817,735,638,759,304,700,332,738,845,666,744,567,862,690,324,883,624,941,934,552,817,423,654,850,801,784,326,493,700,413,732,903,694,803,497,785,713,403,372,481,463,897,439,648,795,947,363,394,907,454,550,764,742,666,645,825,363,396,547,949,325,871,334,658]
["Toyota Solara",600,563,412,306,444,332,839,427,313,378,474,382,754,881,825,855,577,718,578,571,469,412,514,756,487,793,496,702,663,797,422,771,630,869,394,604,645,785,485,429,437,466,594,364,302,771,893,354,433,661,565,421,765,364,800,385,837,827,418,484,555,546,813,463,895,624,802,685,745,769,431,307,591,422,818,871,427,936,828,791,919,537,568,848]
["Toyota Sparky",850,322,932,854,774,555,593,740,796,391,514,472,858,379,313,607,596,551,664,366,429,701,650,434,327,303,347,698,365,526,485,497,358,777,567,610,657,631,632,561,569,763,699,835,743,930,509,486,941,671,409,505,485,934,527,712,314,725,569,425,659,827,305,705,888,766,741,541,540,937,503,580,502,631,710,907,695,706,847,316,602,533,374,930]
["Toyota Sprinter",672,484,869,632,483,609,934,811,462,316,881,657,824,309,647,713,580,837,711,927,767,906,851,427,435,387,325,828,699,773,785,894,415,808,760,660,846,456,421,391,421,704,570,509,349,540,609,641,357,343,520,623,571,941,399,878,404,803,643,572,403,694,839,738,485,608,668,646,407,729,556,662,944,696,763,947,667,688,915,336,389,318,433,734]
["Toyota Sprinter Marino",395,360,620,446,511,478,881,700,879,682,362,721,423,375,488,623,761,380,715,492,492,405,606,908,775,755,410,541,619,443,465,615,803,699,416,519,732,615,888,481,681,499,793,811,656,821,911,417,631,726,912,620,543,649,380,304,737,540,390,458,657,478,846,771,508,685,895,399,947,617,825,392,874,376,897,736,656,317,769,857,751,826,390,495]
["Toyota Sprinter Trueno",512,932,716,426,405,924,630,820,801,750,588,638,720,896,549,402,884,561,617,796,784,874,432,658,880,657,374,900,468,622,702,928,761,383,368,785,531,942,405,874,832,789,924,929,736,559,608,855,784,478,801,894,686,386,935,413,575,931,872,860,742,942,848,648,659,815,930,681,794,398,613,523,540,466,460,653,694,557,788,620,613,485,375,650]
["Toyota Starlet",791,714,945,629,522,803,437,900,322,347,427,449,423,739,537,744,463,620,385,363,656,713,542,485,847,931,858,679,840,375,892,480,781,561,484,356,900,811,457,926,916,500,666,693,629,782,940,845,632,408,521,652,603,571,396,473,358,784,610,788,595,895,854,561,561,394,793,572,670,701,902,360,633,313,339,526,707,506,470,762,352,694,534,815]
["Toyota Succeed",414,885,948,303,680,477,775,853,789,873,449,646,872,724,726,661,905,482,888,841,864,793,489,928,812,611,444,708,418,648,914,715,315,734,484,700,473,884,840,908,480,768,693,730,363,498,937,882,311,720,394,881,429,852,474,632,761,817,315,371,499,457,586,397,801,781,460,826,796,562,328,786,369,888,327,535,599,527,363,817,692,834,709,689]
["Toyota Supra",817,872,632,389,923,525,837,922,570,572,687,738,920,784,800,666,702,901,435,423,559,485,311,470,332,803,867,659,728,854,359,593,494,753,779,333,564,668,326,714,654,677,563,819,348,622,639,876,322,677,496,515,397,492,927,816,938,685,778,828,345,625,919,336,560,402,845,577,676,728,787,741,929,519,864,693,650,362,890,717,308,467,665,336]
["Toyota Surf",322,801,631,440,460,791,850,939,914,772,938,506,312,492,768,542,400,920,673,530,724,733,411,485,727,641,771,398,612,880,922,735,848,381,608,874,533,738,869,535,548,596,451,339,563,432,881,361,893,914,363,562,525,928,684,870,532,879,677,899,706,498,395,376,468,400,551,846,738,662,352,697,765,757,816,641,751,585,930,432,381,844,597,462]
["Toyota Tacoma",378,662,367,516,643,807,671,697,452,408,843,311,660,827,596,372,316,430,888,495,568,662,912,815,916,700,633,779,655,776,831,337,449,334,720,374,706,369,626,470,512,700,922,738,698,498,676,627,610,411,878,432,484,387,904,362,738,443,736,941,550,334,583,621,503,597,880,795,568,623,584,349,553,606,326,937,768,307,582,825,603,725,905,745]
["Toyota Tercel",897,944,425,493,369,848,866,372,851,798,473,332,308,817,515,447,716,384,461,404,429,855,736,847,377,430,788,678,433,644,811,613,546,527,644,452,799,526,376,385,397,912,834,947,401,687,403,598,584,771,849,701,776,497,645,907,313,880,450,553,612,800,571,629,558,552,394,810,529,732,867,698,778,320,452,679,931,365,644,731,460,743,613,948]
["Toyota Town Ace",834,774,827,495,426,598,429,706,780,521,753,760,674,558,773,586,556,671,933,676,810,370,542,827,765,475,481,708,889,686,456,417,703,835,367,605,463,725,373,319,567,626,904,941,883,337,883,793,588,453,888,659,403,835,894,408,556,762,729,624,894,326,888,451,423,370,617,824,943,408,437,676,698,478,709,636,417,688,419,901,646,300,782,934]
["Toyota Town Ace Noah",690,401,567,490,508,535,724,544,363,663,331,899,809,461,630,683,649,510,601,412,359,875,696,401,465,451,390,637,518,763,796,635,793,549,529,620,385,665,466,334,666,877,564,872,455,743,769,607,308,836,424,376,607,443,421,465,346,654,588,515,669,596,465,454,323,704,781,471,794,380,854,741,712,300,855,304,669,732,737,827,485,447,473,483]
["Toyota Tundra",649,884,427,377,779,650,593,551,632,949,845,866,949,419,597,594,612,387,334,829,706,676,681,555,862,848,836,628,611,648,527,328,637,946,719,428,885,857,638,940,787,844,623,673,369,537,323,840,630,387,890,658,733,494,375,457,790,852,588,597,590,370,783,396,749,743,415,712,320,596,532,887,807,840,643,573,916,677,609,855,684,482,946,365]
["Toyota Urban Cruiser",839,414,745,312,738,750,562,542,340,794,554,471,550,947,413,612,507,845,490,425,397,673,769,872,887,450,405,900,620,748,385,466,688,510,625,631,530,762,591,732,913,460,783,525,746,437,480,382,810,629,668,902,481,828,737,856,735,353,417,522,852,830,419,437,579,550,549,587,820,398,348,784,418,814,660,550,698,381,947,397,625,459,325,465]
["Toyota Vanguard",405,379,352,921,347,899,623,382,757,726,664,508,354,475,847,314,327,484,604,694,523,469,644,354,308,385,847,835,419,879,935,716,590,466,300,719,848,936,654,374,425,869,940,723,915,927,782,778,826,712,903,409,533,777,806,439,936,931,503,823,547,540,628,519,543,537,579,311,709,522,662,374,943,667,424,923,523,665,476,897,682,516,888,787]
["Toyota Venza",444,394,575,410,637,424,406,509,716,704,548,729,508,873,460,769,507,373,727,501,320,735,916,709,470,705,733,894,359,491,323,826,792,387,848,928,427,813,469,515,818,950,593,667,411,699,789,483,581,487,632,493,768,818,412,716,639,837,419,804,468,804,448,792,413,762,309,591,949,883,805,944,372,317,594,700,512,450,589,305,476,521,518,911]
["Toyota Verossa",798,643,311,486,561,697,829,362,448,566,366,841,558,829,517,418,716,652,634,374,700,540,835,482,752,607,353,815,917,388,441,440,806,890,488,807,551,687,880,762,627,728,437,851,704,635,745,851,320,412,698,743,899,662,434,380,931,339,737,396,477,689,583,794,911,763,571,421,373,625,818,737,589,586,782,853,339,523,404,897,869,538,351,739]
["Toyota Verso",672,720,586,648,566,927,369,317,303,508,398,317,653,351,536,656,665,798,552,347,659,927,361,391,569,432,326,719,457,389,762,830,340,783,774,607,517,841,351,366,617,930,784,648,417,465,757,782,570,796,929,550,914,878,679,906,894,495,518,455,462,583,814,808,879,311,549,307,800,824,707,629,750,645,348,906,656,773,678,444,880,851,622,312]
["Toyota Vios",324,929,308,530,856,841,796,813,891,949,717,811,317,855,793,868,442,508,905,712,582,572,467,625,771,401,568,450,859,755,868,905,677,495,407,456,519,363,950,933,505,876,406,432,933,441,839,559,610,375,573,328,439,870,789,809,601,708,470,355,721,779,897,533,440,784,457,617,661,784,628,522,370,362,499,678,691,800,399,357,487,622,747,503]
["Toyota Vista",703,690,534,912,876,759,337,746,592,924,817,759,686,667,496,545,875,907,741,602,405,544,752,713,870,348,543,650,809,317,851,543,947,334,873,931,331,693,323,651,409,309,594,765,583,514,532,761,824,922,331,654,644,394,718,505,583,650,634,544,322,880,425,714,830,523,935,333,736,367,931,457,814,350,434,624,660,352,575,731,761,756,678,775]
["Toyota Vitz",573,577,620,405,911,350,373,606,908,514,358,635,316,924,881,750,586,585,909,639,773,685,462,566,390,493,446,322,739,883,348,567,351,754,646,893,372,948,329,305,843,369,455,502,465,310,613,902,371,316,304,426,660,594,411,558,454,917,475,681,402,369,899,683,809,649,606,338,757,828,908,795,530,324,369,595,356,922,713,948,679,650,801,554]
["Toyota Voltz",633,437,586,760,371,858,857,405,477,316,838,473,592,566,424,713,609,566,497,937,627,721,564,603,892,698,684,317,588,512,321,780,885,685,536,663,818,461,673,580,935,743,844,843,708,765,330,893,540,475,816,444,535,741,750,372,822,585,518,944,351,381,460,700,570,883,575,727,421,565,336,874,353,730,556,926,398,810,654,775,341,529,725,647]
["Toyota Voxy",343,942,403,699,905,483,927,877,434,787,431,796,938,927,430,417,591,562,460,915,915,418,875,932,528,625,666,784,641,902,418,320,712,663,351,469,878,362,874,785,564,552,689,919,753,916,739,464,925,393,419,334,526,310,389,859,310,938,571,743,842,927,468,541,309,655,792,479,853,713,652,309,737,448,849,850,375,874,715,496,915,495,306,584]
["Toyota Will Cypha",828,729,823,351,857,917,627,834,333,824,944,893,829,814,518,337,843,510,559,929,814,810,721,356,853,541,719,546,394,455,446,734,343,525,597,945,730,564,300,620,940,371,932,743,542,751,580,638,527,859,762,374,690,482,663,521,812,446,315,903,733,710,932,808,716,755,507,584,725,899,895,761,806,554,845,807,377,670,621,830,520,393,785,561]
["Toyota Will Vi",528,449,691,305,694,472,551,832,671,942,760,309,709,401,600,328,730,465,624,325,329,454,750,450,758,460,782,543,413,756,485,692,583,487,591,895,378,738,552,806,773,798,794,328,523,749,640,493,507,716,943,859,904,633,679,623,695,892,719,319,733,341,650,549,550,925,852,624,343,929,365,700,869,606,544,887,319,301,721,637,538,784,619,706]
["Toyota Will VS",305,628,694,804,507,934,793,513,643,696,624,335,558,776,483,889,653,415,625,727,502,668,542,581,883,525,557,911,603,553,826,825,691,643,317,705,561,323,318,937,756,392,633,402,878,480,459,435,544,776,758,623,722,334,729,724,635,432,555,772,812,394,523,931,889,919,384,529,463,748,612,915,777,936,796,417,661,465,938,890,781,814,628,353]
["Toyota Windom",771,802,388,856,535,682,718,363,861,905,855,571,827,393,322,664,702,692,728,864,747,713,771,833,889,428,857,337,414,815,766,779,867,794,523,452,723,347,635,872,648,712,775,595,754,573,338,764,467,564,503,595,638,671,330,808,532,869,649,343,409,349,480,483,812,346,487,767,814,639,838,536,341,679,915,339,640,751,625,932,845,844,622,692]
["Toyota Wish",753,600,486,684,380,449,347,641,654,636,305,856,678,644,660,872,908,645,453,671,913,414,498,649,387,378,425,395,340,690,626,609,390,409,940,531,426,891,547,791,565,860,469,614,707,800,676,390,776,542,487,525,809,861,573,810,714,942,470,696,549,787,871,872,487,716,369,763,591,832,532,394,528,880,566,540,856,720,563,677,446,477,830,347]
["Toyota xA",932,835,646,925,778,939,711,479,491,455,625,792,618,437,540,905,519,942,629,582,314,393,411,838,814,698,649,726,609,447,615,750,879,854,615,309,888,654,448,321,566,414,589,770,561,536,760,643,461,442,386,775,414,763,701,403,882,388,935,633,612,333,613,939,442,866,740,546,645,687,895,383,323,848,429,933,855,696,750,346,526,510,666,759]
["Toyota Yaris",832,580,710,617,854,850,607,644,494,465,700,828,483,773,383,763,706,769,698,906,467,737,530,819,696,828,644,799,718,718,656,596,872,850,312,619,737,399,496,520,850,314,492,386,797,371,686,412,564,836,904,658,878,864,686,904,334,316,422,639,600,455,757,396,724,451,444,528,854,427,686,353,677,537,408,408,836,436,634,575,885,512,366,308]
["Toyota Yaris Verso",903,780,397,526,391,516,480,746,811,943,668,443,694,409,635,695,322,525,612,458,837,728,616,657,938,353,864,414,509,672,832,900,397,542,777,540,524,628,921,849,498,622,566,555,637,718,721,780,804,777,845,612,579,608,410,900,950,374,646,911,603,410,897,316,334,549,338,607,743,725,556,910,738,434,522,370,581,847,667,347,662,892,717,715]

{"sheet":"Nissan","index":9,"n_rows":115,"n_cols":85,"rows_kept":115,"cut":false,"hidden":false,"merged":[]}
["Nissan sells","2016-01-31","2016-02-28","2016-03-31","2016-04-30","2016-05-31","2016-06-30","2016-07-31","2016-08-31","2016-09-30","2016-10-31","2016-11-30","2016-12-31","2017-01-31","2017-02-28","2017-03-31","2017-04-30","2017-05-31","2017-06-30","2017-07-31","2017-08-31","2017-09-30","2017-10-31","2017-11-30","2017-12-31","2018-01-31","2018-02-28","2018-03-31","2018-04-30","2018-05-31","2018-06-30","2018-07-31","2018-08-31","2018-09-30","2018-10-31","2018-11-30","2018-12-31","2019-01-31","2019-03-01","2019-03-31","2019-04-30","2019-05-31","2019-06-30","2019-07-31","2019-08-31","2019-09-30","2019-10-31","2019-11-30","2019-12-31","2020-01-31","2020-02-28","2020-03-31","2020-04-30","2020-05-31","2020-06-30","2020-07-31","2020-08-31","2020-09-30","2020-10-31","2020-11-30","2020-12-31","2021-01-31","2021-02-28","2021-03-31","2021-04-30","2021-05-31","2021-06-30","2021-07-31","2021-08-31","2021-09-30","2021-10-31","2021-11-30","2021-12-31","2022-01-31","2022-02-28","2022-03-31","2022-04-30","2022-05-31","2022-06-30","2022-07-31","2022-08-31","2022-09-30","2022-10-31","2022-11-30","2022-12-31"]
["Nissan 100 NX",163,222,238,132,182,294,151,197,109,155,204,155,252,280,256,161,171,157,198,184,189,284,137,104,158,267,127,231,281,124,128,228,274,287,269,148,117,151,213,141,267,127,206,201,200,101,103,199,104,297,192,143,122,245,184,114,169,235,178,116,215,116,201,192,127,222,297,104,113,187,127,175,212,169,260,136,100,234,146,292,211,104,200,107]
["Nissan 180SX",299,176,115,138,270,175,210,125,275,122,213,287,102,114,192,232,253,286,194,273,256,119,281,293,283,296,159,102,142,180,107,128,110,155,245,181,220,252,219,171,200,292,131,119,239,273,180,235,208,274,220,151,134,294,112,127,170,222,151,248,246,132,277,150,270,264,152,205,266,215,149,141,215,295,255,236,104,155,158,214,157,127,284,118]
["Nissan 200SX",272,243,237,195,174,107,285,180,129,234,211,168,161,140,166,106,175,270,109,274,226,263,252,186,256,191,254,139,245,298,125,107,107,186,244,249,148,246,256,180,153,250,251,235,300,172,219,230,209,261,168,103,134,155,243,220,273,216,124,209,264,279,271,209,260,251,100,298,191,249,142,141,221,240,212,184,228,167,233,125,261,147,200,101]
["Nissan 240SX Chuki",131,158,270,177,161,161,237,131,113,300,115,208,254,245,136,218,240,248,162,278,140,126,238,149,163,283,185,228,241,262,110,185,107,197,196,147,172,283,174,290,157,298,256,237,221,300,225,292,153,268,137,125,141,252,112,255,279,273,200,120,127,101,249,136,272,238,182,218,216,263,271,165,192,273,261,160,210,140,133,213,221,178,121,114]
["Nissan 240SX Kouki",129,260,102,260,241,202,115,179,248,116,250,192,292,267,272,234,216,272,165,282,222,196,100,104,255,149,284,276,121,178,154,124,224,236,147,200,211,203,260,171,131,115,232,167,107,263,226,168,212,177,128,246,194,256,221,119,123,256,125,245,190,269,100,273,248,280,234,241,291,132,138,182,138,165,229,277,113,125,101,150,226,149,134,200]
["Nissan 240SX Zenki",297,101,189,186,147,229,191,272,184,160,288,262,172,254,299,188,299,253,128,149,191,133,242,255,268,193,288,106,103,239,279,261,182,138,259,173,169,151,134,136,288,262,240,300,236,182,297,221,263,134,218,154,280,189,258,122,274,176,135,207,299,169,282,255,187,145,165,269,162,238,245,249,154,260,300,114,140,181,113,157,274,183,249,264]
["Nissan 280Z",190,202,175,191,276,234,291,129,268,172,151,117,254,169,248,207,254,234,139,161,105,239,282,300,133,101,164,272,111,111,153,128,299,190,186,109,227,199,123,235,246,287,215,294,147,123,198,247,117,290,159,111,254,210,283,160,161,148,217,113,298,154,234,100,154,103,105,126,186,285,135,157,182,222,208,101,285,298,198,233,269,245,206,225]
["Nissan 280ZX",159,299,213,199,203,237,107,118,266,150,268,224,252,294,131,242,123,171,105,144,250,253,241,145,101,210,145,194,205,288,291,107,238,186,258,221,256,273,233,168,227,217,140,168,117,106,235,225,300,286,116,258,286,171,117,278,217,206,226,287,234,173,258,250,147,261,154,205,173,244,224,118,229,191,268,288,290,137,175,129,229,135,232,198]
["Nissan 300ZX (Z31)",141,148,278,115,121,251,121,129,213,190,224,238,178,141,131,232,255,248,294,178,139,150,274,249,261,256,185,214,202,268,253,217,263,129,112,171,295,142,178,145,239,228,129,192,270,100,143,196,275,134,122,221,174,225,124,166,150,143,209,103,299,251,120,211,212,215,198,149,155,284,176,194,277,128,126,109,291,172,274,232,293,190,117,200]
["Nissan 300ZX (Z32)",274,201,292,136,112,217,232,272,227,292,242,252,123,102,288,269,155,236,188,144,147,237,285,152,125,271,100,137,243,147,145,214,235,207,252,154,119,268,255,155,176,170,172,219,122,182,281,148,209,286,299,203,299,244,299,172,189,203,177,247,207,159,143,292,100,259,267,114,165,281,146,223,261,153,245,109,248,275,116,137,230,205,225,225]
["Nissan 350Z",185,187,236,129,298,202,174,100,238,284,103,254,208,290,251,243,239,178,146,191,245,210,263,149,136,186,293,112,171,292,106,129,197,146,150,254,236,204,175,187,284,254,249,142,128,285,191,199,138,217,288,250,153,295,222,224,120,230,229,282,294,263,272,296,253,291,267,159,130,270,249,257,189,152,287,146,109,219,168,275,149,240,228,246]
["Nissan 350Z roadster",227,229,180,126,149,193,210,173,108,160,101,219,161,235,232,196,130,196,218,299,189,141,296,173,147,205,148,152,217,157,159,134,272,102,237,198,109,260,184,105,242,170,171,197,267,277,289,169,231,106,278,279,298,216,110,164,149,256,165,208,100,153,167,126,156,124,168,202,208,224,150,186,198,294,196,200,249,252,105,265,156,217,118,207]
["Nissan 370Z",242,108,288,192,125,164,182,253,161,244,279,128,228,186,264,123,115,189,213,245,138,164,289,161,192,174,185,123,246,239,241,233,215,141,169,158,120,195,250,277,168,179,154,130,183,103,240,184,128,151,255,101,181,196,143,187,285,148,283,152,189,246,102,285,279,236,285,192,149,222,239,171,298,231,103,267,121,241,283,221,234,198,240,232]
["Nissan AD",234,197,202,163,262,223,216,183,230,130,257,117,180,146,149,213,152,232,218,132,270,244,194,285,262,250,257,237,123,239,101,295,169,120,103,207,157,129,161,158,248,175,299,163,288,265,107,138,112,191,238,126,210,253,163,149,261,155,275,293,168,300,111,172,278,285,185,253,214,200,233,262,136,235,267,264,212,203,153,272,114,235,144,102]
["Nissan Almera",262,195,290,263,168,215,256,146,253,173,138,238,166,187,288,283,142,119,188,181,272,256,287,191,252,240,195,213,274,241,189,175,211,293,223,279,141,262,259,231,128,299,208,237,172,127,212,171,235,195,287,208,232,158,217,257,119,203,292,299,240,140,114,299,275,114,158,233,201,128,212,141,160,138,174,187,285,252,246,235,115,165,195,166]
["Nissan Almera Classic",184,222,168,101,206,147,287,211,169,181,262,193,287,249,235,141,205,173,234,110,115,174,204,216,113,191,248,266,197,109,143,134,293,161,114,108,114,269,122,228,212,167,215,140,154,166,175,260,108,191,290,186,176,240,140,134,124,125,132,158,272,251,254,262,194,218,210,163,223,281,111,229,207,118,253,270,139,183,282,240,254,148,189,225]
["Nissan Almera Tino",113,250,265,244,277,234,148,242,224,297,228,228,152,218,296,233,126,111,194,161,251,225,151,278,259,172,226,300,172,276,135,218,180,243,149,265,109,185,139,278,178,172,274,125,282,146,275,281,264,124,195,256,157,134,140,205,298,208,139,159,171,283,231,119,221,157,282,212,200,106,126,174,257,179,155,184,144,248,278,126,170,300,297,192]
["Nissan Altima",297,141,177,233,184,192,205,186,259,208,215,252,280,139,207,111,292,276,105,105,107,176,184,287,204,127,174,131,280,214,130,160,258,257,266,261,210,240,191,261,145,297,233,233,183,184,106,247,251,121,176,269,246,149,180,250,294,251,232,132,285,228,147,173,109,262,223,217,271,203,153,217,300,146,120,161,181,189,289,193,109,113,115,143]
["Nissan Armada",182,228,196,107,180,249,103,113,108,290,254,245,243,289,276,182,237,176,243,114,138,223,227,183,260,297,170,197,211,102,291,116,130,267,300,170,131,300,207,284,203,241,254,167,164,279,265,181,264,155,277,273,205,193,274,154,171,292,193,286,180,126,282,144,106,222,136,161,219,254,298,296,109,255,114,145,161,226,145,292,236,259,241,287]
["Nissan Atlas",168,148,181,131,247,270,274,148,261,182,191,293,221,252,204,205,247,197,262,284,192,169,222,115,246,172,258,249,115,226,134,297,247,282,112,240,218,206,214,218,107,293,133,148,290,130,154,231,117,175,190,155,153,117,213,205,292,239,177,172,185,110,202,175,197,263,123,114,107,170,155,271,205,155,206,287,157,275,123,202,100,251,270,207]
["Nissan Avenir",105,214,300,130,273,168,237,274,256,214,197,179,277,236,232,209,259,224,206,287,260,142,218,150,153,104,242,169,123,165,285,134,288,114,115,121,133,292,268,182,173,278,157,277,228,295,294,264,120,151,118,224,112,173,141,182,296,243,239,238,101,124,248,131,103,243,217,274,227,145,113,262,278,268,173,247,138,163,280,161,241,197,111,176]
["Nissan Bassara",105,101,237,225,190,173,171,240,245,216,258,143,159,139,212,203,113,154,195,202,179,220,153,283,112,160,266,243,275,276,188,270,225,234,157,165,100,139,271,118,298,224,295,252,174,263,263,279,133,113,214,153,212,253,115,282,228,173,128,168,297,158,297,270,199,265,275,269,229,107,101,143,217,107,159,252,225,248,273,134,252,125,188,173]
["Nissan Bluebird",105,257,245,180,296,159,226,172,202,166,142,212,203,125,170,148,160,169,246,273,247,152,293,125,191,240,191,221,110,177,227,125,252,272,203,217,219,289,101,294,205,280,273,220,225,152,144,251,247,282,136,177,169,174,214,229,245,162,165,214,212,220,254,171,145,269,214,194,225,141,163,194,185,102,262,264,259,187,279,292,252,142,257,140]
["Nissan Bluebird Sylphy",189,241,280,258,294,244,297,117,263,157,143,142,223,273,183,181,264,181,290,224,207,147,138,217,252,174,278,291,279,210,246,153,231,198,221,262,141,155,151,264,246,202,148,244,181,252,280,242,201,246,126,189,243,117,242,203,255,200,196,256,155,210,234,147,127,256,146,116,287,144,186,120,235,206,300,243,187,282,195,260,270,117,170,292]
["Nissan Caravan",159,263,132,260,125,289,217,128,167,199,255,100,261,103,216,173,134,225,158,220,264,261,219,110,130,260,249,229,282,202,177,182,225,136,281,186,159,237,274,198,185,299,203,300,206,186,221,144,271,111,248,254,162,284,285,257,125,110,233,137,232,124,202,181,283,252,278,241,173,298,251,239,152,253,131,118,123,286,293,123,116,167,183,289]
["Nissan Cedric",226,243,167,161,278,214,248,102,174,294,217,288,269,251,225,241,154,173,207,248,134,206,122,226,106,139,228,141,247,292,197,228,298,283,101,216,284,212,256,176,180,254,143,188,173,204,254,193,277,197,214,136,134,108,139,288,143,106,281,255,260,255,266,248,166,126,270,166,232,113,199,199,175,224,219,254,254,261,275,125,122,122,245,136]
["Nissan Cefiro",135,207,155,229,196,161,134,154,234,209,283,241,130,123,146,112,122,166,284,175,188,246,295,174,134,225,227,104,145,180,253,261,184,127,193,240,133,217,204,116,177,161,137,169,219,149,125,216,100,221,272,276,142,217,184,242,121,221,107,134,268,229,262,120,110,159,174,226,128,125,260,250,226,246,109,285,243,264,259,231,198,129,287,195]
["Nissan Cherry",166,128,148,161,203,141,277,134,255,197,255,207,179,179,204,129,115,158,215,184,222,210,188,249,159,189,131,246,294,192,291,256,211,234,241,280,180,250,163,118,215,114,269,287,299,133,172,276,132,255,180,215,154,107,211,188,127,241,220,164,151,244,280,246,195,246,184,276,149,133,168,163,244,219,155,155,276,195,226,194,297,181,296,287]
["Nissan Cima",300,101,168,146,146,297,255,262,198,137,170,123,188,155,261,127,299,290,280,262,125,198,173,231,196,113,127,262,102,126,175,273,299,249,177,249,107,257,260,170,101,104,131,158,103,226,277,218,117,146,211,299,231,137,239,151,267,214,254,289,113,244,240,288,211,259,185,155,120,258,136,100,299,127,109,238,290,139,210,127,219,218,174,136]
["Nissan Clipper Van",170,125,245,132,236,280,249,242,119,129,113,155,232,121,100,224,116,269,174,113,152,277,299,278,258,119,218,241,198,101,211,151,244,242,150,191,222,226,165,273,170,234,169,229,236,270,203,121,239,184,252,125,178,105,130,149,294,214,106,184,197,181,163,155,266,278,180,119,186,254,178,251,143,174,111,283,219,145,158,295,224,191,283,156]
["Nissan Crew",265,102,252,298,226,118,170,178,126,175,263,137,118,106,267,140,191,195,214,162,205,187,247,274,254,101,112,240,147,234,285,215,133,107,262,129,169,212,101,122,185,105,251,261,192,235,298,142,103,161,164,156,236,156,291,196,169,180,215,150,143,289,108,290,231,163,207,271,271,226,226,242,111,168,199,140,103,159,217,238,247,166,266,169]
["Nissan Cube",109,142,258,297,132,194,201,271,268,125,181,183,273,296,107,242,158,174,106,162,254,279,247,105,102,109,164,107,282,221,131,288,149,143,196,246,263,292,263,219,109,162,142,119,130,117,222,209,136,216,234,180,155,147,197,249,187,113,150,128,272,287,214,157,218,212,228,274,174,237,222,198,217,120,261,287,178,134,123,185,142,218,173,139]
["Nissan Datsun Violet",282,122,292,280,243,103,119,140,252,210,179,249,237,254,264,198,107,295,297,148,247,280,244,126,257,250,182,181,221,293,236,167,280,118,190,247,297,207,120,108,188,237,253,208,146,273,247,117,105,169,273,195,177,151,260,244,196,240,297,226,282,165,299,128,292,229,211,213,299,292,200,158,117,213,125,147,187,111,120,278,230,175,202,294]
["Nissan Dualis",126,223,270,165,205,167,108,300,181,154,229,167,278,238,266,273,272,161,242,239,264,176,156,265,112,156,133,135,281,185,157,127,103,288,104,187,143,190,225,148,233,251,135,246,226,270,175,207,278,300,204,195,193,116,233,164,287,251,113,285,116,135,149,221,112,282,189,213,178,110,173,235,129,178,149,129,290,200,121,162,202,144,228,300]
["Nissan Elgrand",253,169,273,273,259,122,290,284,175,215,107,116,281,215,208,229,207,289,180,140,160,149,228,166,234,156,226,134,187,174,186,204,143,141,273,265,298,297,283,120,215,179,193,203,219,212,245,274,111,168,165,224,210,159,263,174,283,196,119,173,159,240,213,239,234,222,103,292,235,143,274,139,118,239,109,127,177,264,271,237,290,167,229,106]
["Nissan EXA",282,157,134,251,296,297,127,182,156,171,123,298,247,101,241,300,295,241,181,138,237,190,112,112,254,254,138,285,142,253,248,230,224,101,259,198,186,148,147,174,273,113,276,170,205,100,110,281,219,100,147,159,118,297,108,257,270,218,177,266,240,155,284,235,150,115,123,115,237,111,153,226,247,220,286,184,233,184,172,214,246,126,220,178]
["Nissan Expert",170,194,245,140,275,223,255,189,184,173,259,295,205,225,299,197,207,184,266,150,109,134,224,154,148,139,164,178,142,248,149,114,117,148,153,165,119,231,159,294,257,269,293,239,137,180,256,187,157,136,255,107,224,105,291,261,242,282,143,151,282,131,244,202,112,273,275,120,268,122,299,238,211,175,228,162,251,286,274,241,283,112,163,261]
["Nissan Fairlady",209,224,292,162,209,280,125,110,152,174,156,262,134,241,154,167,146,295,130,133,266,220,129,109,168,136,113,203,131,210,120,122,280,177,249,178,299,185,177,182,264,168,263,115,166,166,261,251,244,280,142,148,272,247,106,213,192,260,264,209,127,167,191,203,124,294,268,292,111,251,286,288,192,178,273,231,225,195,160,177,160,277,235,202]
["Nissan Figaro",261,149,213,200,258,234,250,267,291,199,230,201,260,222,120,180,299,123,174,164,124,233,150,230,285,167,166,153,186,102,292,284,140,148,258,262,229,142,160,220,259,194,210,185,293,230,161,148,125,181,225,183,177,215,244,191,294,162,133,284,153,220,205,138,278,130,181,136,255,176,212,278,152,278,133,243,256,109,128,275,127,178,118,151]
["Nissan Frontier",130,234,209,246,268,206,272,144,125,201,261,102,269,154,193,124,208,156,286,213,140,177,151,184,260,277,192,261,217,195,112,134,156,232,263,224,118,103,191,213,173,239,208,108,292,133,299,192,229,157,193,199,212,190,259,206,276,270,109,125,189,253,122,243,139,196,226,206,168,250,251,269,101,136,170,220,282,257,213,261,271,180,271,207]
["Nissan Fuga",227,262,171,155,148,239,224,250,188,136,222,295,249,138,286,222,167,114,132,201,290,153,268,244,265,195,253,130,176,255,230,210,175,242,150,186,215,157,148,271,152,153,212,292,187,160,283,282,252,238,101,101,291,278,300,200,145,207,102,280,222,263,204,282,148,201,283,182,130,271,134,288,118,234,122,156,151,217,159,186,166,231,152,285]
["Nissan Gloria",300,222,102,233,116,127,183,121,205,289,192,137,291,135,188,102,280,273,161,275,257,129,206,111,137,236,158,104,247,191,235,144,208,179,187,109,112,300,106,273,288,162,103,219,261,270,295,109,127,132,160,109,177,116,135,124,197,273,286,207,265,195,149,122,157,213,123,154,205,300,240,141,182,183,294,163,142,295,232,166,199,133,251,299]
["Nissan GT-R",205,154,120,272,237,221,206,300,292,265,283,142,122,181,101,222,248,269,177,114,193,275,122,215,219,287,115,137,242,193,116,292,138,146,279,136,188,283,233,284,151,249,211,258,158,127,276,177,180,296,109,106,240,132,108,242,175,125,201,163,137,296,168,190,286,229,183,125,135,133,278,261,183,147,165,121,209,171,218,294,282,169,155,167]
["Nissan Homy",265,137,249,235,189,261,150,214,275,234,166,149,184,185,292,158,278,283,219,160,178,170,100,154,157,167,176,247,105,279,101,287,237,246,257,227,176,112,253,257,156,178,263,206,205,100,277,263,201,168,247,174,235,263,127,120,115,226,173,211,132,257,177,203,300,173,151,247,261,230,210,155,278,157,189,195,108,130,277,106,142,229,225,229]
["Nissan Juke",257,205,194,132,222,112,200,220,101,138,272,189,206,157,229,271,229,261,124,194,268,100,169,255,278,278,143,118,118,188,119,164,130,223,198,252,298,187,217,269,138,220,194,151,169,193,180,243,245,200,247,139,241,203,260,190,119,269,222,108,300,105,223,212,197,293,198,181,168,260,171,188,160,193,232,138,172,259,265,172,107,148,239,123]
["Nissan Kix",163,101,280,156,120,151,276,152,251,132,252,219,277,260,140,256,188,203,293,289,186,285,175,248,287,182,122,112,123,266,260,117,239,153,102,276,258,177,144,105,296,261,218,138,187,255,214,289,140,158,104,251,273,214,199,100,250,176,151,243,183,186,204,236,289,171,177,274,211,126,244,260,161,214,263,177,258,196,180,162,263,266,103,177]
["Nissan Lafesta",117,146,246,197,243,272,205,225,223,240,262,146,124,196,177,120,254,165,183,137,202,245,203,220,185,260,123,107,229,271,166,120,165,123,201,142,271,223,227,298,102,277,176,165,263,130,272,111,259,205,163,203,164,206,274,250,129,243,111,198,224,239,163,196,250,162,294,221,128,220,128,141,129,162,195,107,232,155,124,224,230,194,215,284]
["Nissan Langley",300,251,196,131,195,127,189,112,263,165,232,289,220,295,111,137,216,150,286,100,299,263,183,288,261,125,179,122,136,164,181,299,178,207,169,120,198,254,237,152,220,283,189,115,183,195,118,159,108,122,148,168,178,193,179,259,123,281,156,268,246,159,187,293,146,166,300,281,107,151,113,237,113,101,199,191,156,210,104,104,202,296,299,172]
["Nissan Largo",244,254,281,274,154,127,196,169,103,191,127,234,166,119,161,190,128,120,280,201,110,150,242,205,249,286,207,161,141,102,147,229,200,130,175,264,264,192,284,245,291,275,222,160,158,248,222,286,296,289,110,153,288,246,278,163,182,260,132,106,278,179,113,194,190,110,178,251,151,254,185,232,237,295,196,256,295,274,162,162,247,211,195,271]
["Nissan Laurel",213,115,276,279,255,217,124,288,296,212,246,172,182,177,197,125,258,153,264,217,238,109,167,182,280,106,211,204,248,193,143,154,173,124,113,152,191,256,199,174,115,256,126,253,210,115,206,290,247,271,191,198,219,133,252,246,119,282,217,263,114,219,192,204,273,106,104,168,112,174,157,242,208,260,109,148,173,145,271,202,268,146,103,211]
["Nissan Laurel Spirit",256,119,153,176,199,146,166,184,264,290,253,176,139,294,180,227,292,192,192,165,245,185,187,202,142,224,227,126,168,174,115,258,219,267,182,134,265,137,118,124,159,178,280,217,228,103,284,142,258,293,251,163,288,133,172,218,168,164,126,163,276,247,292,200,279,236,213,185,110,184,202,193,135,169,129,148,225,128,247,103,250,163,260,289]
["Nissan Leaf",167,175,260,118,123,110,259,300,159,186,209,290,220,212,277,250,147,207,229,266,111,105,232,195,103,187,125,221,186,147,245,287,102,160,266,160,276,260,290,144,276,150,110,103,251,265,177,230,155,267,120,220,161,143,180,290,102,247,237,245,146,213,207,181,150,222,108,193,279,179,163,129,294,290,139,208,189,119,178,226,121,253,118,196]
["Nissan Leopard",220,141,230,249,231,268,299,102,204,174,285,155,208,102,147,153,296,226,222,190,289,268,173,214,164,165,149,180,215,285,173,115,210,295,150,258,189,107,292,123,223,264,288,140,152,189,144,246,204,288,128,119,118,117,252,218,151,121,217,192,281,219,143,280,153,159,225,229,233,122,250,110,277,160,140,223,177,161,170,229,195,218,221,221]
["Nissan Leopard J Ferie",157,130,274,190,292,199,237,114,292,154,212,164,207,145,213,181,219,272,163,239,209,108,252,167,200,295,107,227,285,175,273,273,296,214,162,194,279,173,221,243,244,163,208,300,214,100,126,300,135,116,190,235,125,256,124,179,128,204,175,154,226,138,162,285,240,123,263,146,153,153,297,262,259,100,265,297,114,280,265,224,188,149,124,284]
["Nissan Liberty",267,179,197,186,300,175,133,295,100,194,258,250,289,191,104,118,271,121,291,250,290,142,266,270,250,142,133,257,243,145,300,200,125,219,293,294,147,243,252,264,286,173,152,150,125,199,175,172,229,261,278,154,256,180,282,234,269,190,173,154,229,115,289,164,184,149,205,201,286,265,159,148,171,163,190,115,147,173,254,240,199,201,156,238]
["Nissan Lucino Coupe",236,113,176,255,235,271,215,241,147,172,262,264,213,273,272,140,156,233,208,182,265,149,200,265,173,241,253,165,147,265,138,257,149,119,169,102,210,251,141,178,117,267,148,249,237,150,282,176,182,242,148,126,198,148,130,126,285,286,166,172,158,214,167,226,182,260,117,126,174,168,155,102,149,119,121,292,206,286,157,285,267,159,263,111]
["Nissan Lucino Hatchback",225,257,131,162,226,263,220,231,257,221,122,262,157,222,181,225,281,232,240,195,244,224,145,289,212,122,174,130,219,147,238,136,139,221,130,151,226,165,163,297,136,184,253,230,231,179,119,160,237,296,288,265,107,154,209,240,185,237,260,243,290,245,248,148,265,258,182,214,222,170,218,117,240,277,140,300,163,198,217,136,279,300,233,131]
["Nissan March",268,189,230,150,162,250,121,289,211,249,212,214,273,179,100,119,298,285,264,293,284,142,268,187,287,266,211,178,253,209,276,261,221,144,133,217,161,253,124,269,134,294,294,228,136,293,231,234,233,300,273,265,192,235,167,106,236,224,192,114,171,118,252,288,210,285,257,190,172,153,250,131,218,257,153,168,285,121,145,104,168,171,277,179]
["Nissan Maxima",160,296,113,123,297,159,117,294,210,190,226,239,128,296,165,205,259,143,191,197,193,233,121,192,186,270,294,226,288,145,139,250,177,235,177,163,157,198,297,238,164,230,253,162,162,219,246,272,141,136,200,262,123,234,127,107,154,266,264,186,275,127,161,183,100,221,140,273,140,224,164,150,131,210,152,187,179,179,234,207,178,214,296,215]
["Nissan Maxima QX",249,151,274,221,166,255,224,119,120,175,119,285,165,168,168,112,105,115,233,231,283,147,212,266,255,286,185,281,288,233,227,123,200,235,200,273,103,187,214,203,297,221,296,233,284,201,279,111,276,179,195,247,260,209,135,271,164,292,213,295,141,187,123,212,158,270,209,200,194,206,195,210,257,262,242,257,293,156,128,294,178,142,142,195]
["Nissan Micra",228,297,279,225,244,236,186,163,174,253,240,169,206,148,135,244,112,282,175,261,166,276,237,218,138,179,176,185,252,266,136,102,222,281,119,271,290,201,163,125,189,271,232,190,145,257,285,224,177,161,218,151,162,173,206,271,174,124,255,278,242,234,198,162,137,152,283,285,233,238,212,116,249,105,178,147,232,236,182,129,238,168,106,117]
["Nissan Micra C+C",127,105,192,263,289,259,120,142,232,284,120,284,217,219,158,220,247,154,175,269,287,163,105,172,120,180,207,171,205,100,289,181,228,205,189,138,193,184,128,111,171,246,221,193,147,150,289,233,162,107,279,165,231,241,242,274,218,181,147,215,101,109,164,258,221,142,144,273,113,292,135,177,136,121,295,245,298,216,237,127,169,256,158,194]
["Nissan Mistral",104,257,148,119,173,294,115,139,236,214,200,232,189,217,296,227,224,141,134,196,180,155,134,262,220,119,111,108,163,108,103,217,109,193,181,134,157,275,191,169,288,157,272,156,193,250,234,143,229,131,287,129,113,290,222,112,132,221,189,229,274,159,149,234,252,114,262,185,113,146,215,150,133,190,203,246,212,103,183,230,108,226,138,277]
["Nissan Moco",174,209,267,296,144,213,290,299,177,279,285,118,196,264,217,117,230,207,187,242,122,203,192,163,160,283,226,207,158,298,206,143,165,110,274,256,213,291,153,178,285,231,278,205,262,151,191,178,252,241,286,264,209,108,115,296,146,179,195,202,255,137,151,242,110,203,282,133,235,164,131,105,107,276,267,169,211,227,218,146,262,182,140,166]
["Nissan Murano",126,209,288,255,284,124,113,205,103,129,135,233,180,185,114,168,260,134,264,207,245,201,161,100,136,185,264,186,124,173,102,211,124,240,242,291,252,245,122,146,160,275,243,232,210,149,224,275,186,260,216,284,199,129,300,243,211,287,242,119,272,179,102,201,196,269,286,161,256,232,201,289,271,197,234,272,300,230,177,281,126,229,222,275]
["Nissan Navara",207,243,119,126,267,119,155,250,298,259,245,158,114,223,250,199,125,253,228,264,222,181,255,237,280,289,165,211,256,109,162,131,164,182,235,184,194,237,297,137,269,172,189,278,185,120,171,210,256,200,188,190,120,108,272,178,289,135,260,136,114,203,172,275,237,236,225,266,236,275,223,215,165,294,273,280,177,161,144,284,247,113,118,264]
["Nissan Note",184,187,152,111,109,174,198,222,149,192,287,141,145,188,209,133,276,281,242,267,147,166,129,137,133,288,148,300,139,109,280,111,203,107,249,171,229,222,294,200,100,131,233,197,165,145,287,251,284,289,102,158,108,183,171,163,158,255,223,290,288,253,224,117,102,111,298,133,143,253,274,205,259,116,119,129,257,272,155,191,253,124,244,117]
["Nissan NP300",250,209,130,288,289,119,114,246,160,135,246,271,217,238,106,135,285,107,262,271,249,275,129,284,295,260,191,292,201,224,137,286,214,260,232,248,159,262,166,172,222,243,198,273,294,300,245,181,158,128,145,269,286,282,108,138,223,284,133,244,258,117,142,194,184,136,223,259,226,258,201,151,194,266,164,219,277,233,140,274,202,214,107,280]
["Nissan NV200",207,272,278,123,119,119,237,149,186,218,244,110,112,284,108,244,119,295,162,217,220,171,267,228,144,103,249,156,298,108,112,130,128,147,297,237,279,180,186,225,112,238,200,114,272,280,269,246,146,239,151,178,265,280,207,158,131,214,119,259,271,232,129,224,294,243,194,163,119,126,152,179,190,204,135,247,152,201,174,119,129,266,194,153]
["Nissan Otti",182,132,149,271,142,160,242,285,222,151,268,110,104,181,168,249,226,100,249,153,189,244,258,282,173,213,162,267,222,167,158,258,249,297,294,260,251,138,225,241,293,287,205,277,135,141,298,197,282,110,232,281,180,210,148,184,261,212,266,111,296,123,227,278,267,224,214,123,102,160,278,132,228,208,225,164,185,273,247,119,190,117,176,209]
["Nissan Pao",261,296,182,110,152,215,172,111,128,162,233,165,281,164,289,151,135,248,267,182,193,113,109,124,151,151,297,141,151,282,273,179,276,181,160,114,284,137,277,182,209,110,298,172,263,221,266,174,109,220,276,270,222,176,103,235,172,300,102,233,114,237,284,269,262,110,163,142,144,157,206,212,207,139,119,161,233,243,136,209,161,225,196,228]
["Nissan PathfinderP",256,238,173,179,292,188,294,109,296,264,205,125,169,175,222,252,114,154,254,106,140,199,187,239,120,283,297,114,205,292,130,144,133,187,298,146,124,160,222,268,202,109,217,271,103,208,292,268,188,229,235,260,146,133,299,217,131,243,128,299,167,103,158,162,178,181,253,132,215,148,231,182,165,113,241,218,293,105,240,182,125,233,240,219]
["Nissan athfinder Hybrid",227,211,244,202,233,218,150,269,174,114,247,186,100,201,234,162,250,171,212,283,279,248,255,193,103,268,110,266,218,259,240,274,122,118,134,145,140,121,152,135,241,112,261,211,254,258,290,200,144,254,125,123,281,136,190,101,278,217,258,135,219,184,300,209,103,191,209,104,105,137,226,228,213,231,148,135,154,168,238,113,280,272,197,284]
["Nissan Patrol",273,222,248,149,103,160,243,111,235,161,107,229,171,291,233,102,286,219,274,141,242,159,218,169,119,269,208,101,142,263,144,270,276,223,158,183,210,208,221,149,105,127,217,201,218,183,103,177,168,160,191,174,300,240,117,182,167,276,284,122,234,183,240,166,149,228,212,123,193,141,149,290,282,267,193,172,216,156,282,265,276,266,273,141]
["Nissan Patrol GR",180,208,290,291,101,249,265,106,145,136,150,117,112,215,133,112,296,129,247,202,130,283,251,286,211,220,211,142,286,154,214,146,104,256,132,288,149,167,103,267,263,209,208,213,177,114,102,288,158,230,259,176,200,231,151,134,281,278,214,297,184,229,160,117,203,110,254,257,168,151,283,220,287,114,147,179,251,256,106,183,127,164,286,273]
["Nissan PickUp",244,264,148,231,272,217,160,177,269,208,233,205,216,297,218,281,164,185,255,197,121,123,246,151,230,253,220,294,118,220,220,189,285,115,158,136,169,158,293,233,189,193,291,151,146,278,152,212,145,272,208,207,199,234,189,205,269,242,257,248,288,252,233,193,181,243,291,146,142,261,265,252,151,198,167,261,142,211,230,250,199,270,157,163]
["Nissan Pino",297,218,297,166,272,239,193,118,164,300,182,164,262,104,109,264,281,270,133,231,274,144,296,160,125,297,173,140,111,250,254,297,130,240,268,271,202,300,147,105,179,233,262,170,108,185,157,102,163,152,253,218,268,254,199,221,142,299,114,281,130,210,182,158,226,164,146,215,217,193,262,272,135,159,196,284,290,216,104,237,183,293,116,222]
["Nissan Pixo",231,107,234,196,195,292,176,283,226,284,235,123,259,243,142,173,172,254,248,151,209,146,149,278,278,276,241,263,245,156,248,162,159,260,157,201,265,193,131,268,161,136,213,295,155,141,254,174,227,175,124,203,170,253,113,149,262,174,158,300,123,154,161,161,111,224,110,220,181,137,120,219,133,287,109,131,224,191,230,116,277,238,241,205]
["Nissan Prairie",160,142,237,175,114,187,278,236,197,199,246,276,164,195,191,132,234,102,220,104,141,224,259,253,293,131,259,179,245,227,206,300,166,249,279,283,290,234,149,157,294,286,232,256,101,115,209,108,283,203,121,294,222,141,136,262,100,165,139,147,236,249,102,197,231,178,196,107,181,298,268,232,174,188,157,170,116,229,249,236,113,160,174,233]
["Nissan Presage",149,112,143,109,238,195,253,198,147,180,101,238,135,276,112,294,274,249,186,205,174,143,295,107,235,146,169,255,246,111,185,236,236,245,198,295,147,209,196,262,182,205,279,104,194,251,277,170,259,214,276,246,213,128,163,167,252,152,299,107,140,179,231,183,176,263,248,285,155,231,179,298,106,230,262,244,255,185,131,205,156,255,278,217]
["Nissan Presea",143,156,242,272,264,102,203,296,173,215,139,162,239,102,233,159,117,118,144,280,249,137,291,283,280,297,294,121,268,149,170,102,146,181,103,186,294,199,256,131,112,150,286,159,127,125,157,164,233,136,195,220,123,186,119,239,254,269,294,293,208,142,185,183,286,176,291,262,283,227,177,206,125,206,188,144,273,291,186,277,173,195,245,100]
["Nissan President",206,200,195,132,270,202,115,124,101,234,174,170,162,101,138,154,298,285,144,152,114,129,249,282,183,142,173,143,173,143,188,153,218,100,110,281,245,109,299,202,117,280,103,252,183,284,136,276,253,273,122,278,232,228,278,138,131,208,249,154,271,161,282,202,106,293,277,111,254,159,189,171,177,296,193,228,155,157,160,245,187,106,171,282]
["Nissan Primastar",256,122,104,137,124,213,152,249,175,205,201,175,256,243,106,164,152,241,103,167,161,100,187,183,181,138,278,174,151,182,129,265,147,173,166,182,155,225,132,112,220,106,202,194,180,252,235,112,137,195,151,284,274,248,300,274,142,277,225,235,251,254,191,136,189,212,178,156,177,177,204,299,204,160,292,267,229,178,168,241,120,192,163,192]
["Nissan Primera",254,126,264,113,249,261,278,121,199,286,187,124,124,183,297,230,178,171,132,298,112,238,180,101,263,237,274,126,221,297,201,287,188,163,145,207,136,201,204,126,238,110,142,175,118,198,196,120,180,288,241,214,271,229,241,172,177,182,202,268,194,133,256,123,298,177,117,183,265,176,108,283,262,127,224,292,282,268,108,140,234,166,182,195]
["Nissan Pulsar",217,127,109,162,102,131,264,243,113,230,163,178,240,104,251,218,195,252,300,207,183,286,292,261,136,165,238,182,178,173,212,166,112,158,205,227,108,226,255,210,170,179,258,225,121,123,170,165,166,100,217,227,276,115,196,134,264,283,155,149,231,122,113,228,104,115,137,171,195,152,250,220,139,248,243,252,102,159,291,213,182,234,213,200]
["Nissan Pulsar GTI-R",199,211,157,283,142,171,273,254,293,116,199,300,100,103,282,150,220,243,154,243,260,175,127,291,276,179,300,203,232,248,248,179,202,118,246,100,288,184,281,288,283,284,255,180,192,218,231,226,212,220,144,296,261,241,140,173,270,118,198,200,104,293,234,296,284,279,180,269,101,270,296,138,268,300,105,149,278,235,142,115,121,229,109,117]
["Nissan Qashqai",102,105,244,179,219,271,234,228,193,140,132,111,178,157,134,233,106,190,270,154,162,192,253,237,280,251,230,160,198,161,174,143,244,137,300,144,221,136,125,191,277,235,213,244,214,272,265,118,283,159,264,168,235,297,176,143,136,243,237,283,193,165,202,210,267,251,218,257,291,208,227,273,178,118,142,189,225,115,182,101,256,144,233,103]
["Nissan Qashqai+2",212,168,129,213,282,211,222,120,140,253,177,181,166,154,199,226,100,152,282,237,149,126,146,122,237,175,263,198,297,260,248,260,186,196,293,262,243,143,192,222,149,127,284,277,192,234,300,296,243,142,132,131,175,245,158,161,243,112,211,278,285,102,139,230,168,179,270,156,176,110,295,227,224,256,165,237,260,262,257,154,270,202,128,154]
["Nissan Quest",250,191,261,205,107,255,116,186,245,195,130,117,219,141,222,248,299,176,115,245,273,111,185,266,106,181,273,203,189,189,230,175,257,295,219,226,296,117,289,211,176,248,134,118,219,224,116,178,264,139,113,299,109,253,172,138,225,149,133,118,120,282,238,108,194,161,162,298,151,257,289,288,300,261,198,138,192,277,127,205,150,184,141,252]
["Nissan Rasheen",146,258,291,137,260,198,207,233,250,286,283,245,233,128,271,216,249,195,255,106,247,219,224,159,179,106,148,114,279,207,269,216,287,289,134,118,287,219,201,126,175,252,239,300,162,105,125,258,202,299,220,297,247,103,204,203,111,184,184,105,177,112,124,213,265,175,126,100,146,207,138,225,249,152,212,167,180,239,232,221,267,126,197,106]
["Nissan R'nessa",111,178,108,182,196,203,163,158,141,115,273,241,263,295,120,165,142,251,263,217,247,124,164,193,166,110,134,155,244,163,158,231,182,283,120,189,159,158,266,237,174,232,121,166,143,144,273,287,130,235,157,294,178,193,235,201,114,102,167,182,104,292,139,186,232,254,156,102,163,174,295,149,109,249,240,266,238,166,223,101,116,233,149,114]
["Nissan Rogue",293,127,274,123,288,254,299,264,184,204,288,135,220,254,281,115,233,113,262,174,286,276,101,285,277,238,200,200,196,181,274,271,290,213,241,223,116,279,294,285,159,129,223,241,164,250,120,182,226,110,254,218,232,135,210,212,150,204,108,276,164,150,227,142,165,138,130,259,130,296,273,230,198,137,121,167,177,281,159,190,182,279,146,119]
["Nissan Roox",134,138,198,190,159,120,269,157,172,259,242,122,285,185,116,154,300,131,132,247,138,237,250,266,185,266,134,145,222,162,216,107,231,192,150,221,178,285,278,143,295,192,192,182,266,113,281,261,109,112,118,209,258,293,112,101,108,108,273,283,198,136,111,112,283,126,187,165,159,242,230,205,203,145,243,237,250,256,121,258,232,101,185,291]
["Nissan Safari",253,224,210,102,213,221,286,235,122,272,217,253,113,238,117,153,116,247,220,158,112,140,256,143,100,233,292,199,236,239,241,133,228,164,205,121,259,120,143,120,252,191,259,165,260,198,108,234,299,177,157,129,147,219,280,270,115,244,292,125,242,166,205,110,200,245,234,164,169,219,177,153,177,210,183,113,218,140,145,214,139,162,116,178]
["Nissan S-Cargo",235,149,223,122,165,194,202,177,152,152,286,158,100,197,114,144,161,139,144,186,102,176,276,298,137,230,159,120,226,294,206,266,182,259,255,175,142,174,224,136,268,223,255,149,277,165,132,300,251,190,157,148,261,193,188,141,283,105,135,220,232,151,242,265,254,153,172,269,119,212,129,196,249,289,249,178,147,110,125,145,270,123,100,230]
["Nissan Sentra",206,239,115,128,133,142,205,265,199,213,242,166,283,276,231,215,158,172,234,232,116,290,278,239,233,298,184,278,106,298,153,126,115,134,184,122,132,103,102,139,192,182,203,141,257,140,101,243,181,158,122,194,138,203,283,251,206,138,256,185,115,125,268,188,236,104,180,237,152,207,232,223,225,139,203,300,270,191,185,125,253,178,282,203]
["Nissan Serena",179,171,243,267,252,120,276,261,264,210,166,226,209,203,233,269,165,123,289,183,172,204,111,135,296,275,145,140,202,183,290,171,142,254,149,252,277,161,206,259,140,204,171,127,225,297,140,154,178,101,262,129,214,275,106,116,247,224,178,164,163,247,180,289,199,293,153,234,270,260,288,257,281,244,104,122,288,137,294,106,106,277,131,138]
["Nissan Silvia",194,105,231,271,142,188,237,207,185,155,294,153,253,109,111,291,272,214,135,237,129,269,196,217,236,147,191,283,151,138,207,172,276,281,298,288,217,235,163,249,180,171,152,133,109,264,241,247,100,294,252,134,243,239,119,202,233,132,188,246,232,226,125,265,261,277,234,296,112,262,200,104,128,120,229,122,134,230,182,114,258,131,105,267]
["Nissan Skyline",237,225,173,190,255,183,112,242,218,271,149,164,285,296,117,289,151,124,118,114,207,131,201,219,271,124,285,284,142,215,263,288,178,103,226,235,270,166,122,167,117,208,211,138,127,128,281,237,262,288,145,176,120,238,193,100,183,109,168,200,230,131,144,160,160,295,149,272,152,136,213,213,278,292,235,265,202,167,273,150,104,105,184,294]
["Nissan Skyline GT-R",219,143,148,204,148,143,212,249,142,298,163,138,132,126,256,198,222,298,171,242,282,129,189,143,132,109,284,289,248,184,287,173,130,147,136,261,230,178,194,107,102,255,231,117,273,205,103,172,111,132,265,102,144,169,161,277,215,254,119,146,118,147,107,285,238,254,223,105,169,158,248,156,237,288,104,202,269,135,107,138,116,104,241,259]
["Nissan Stagea",241,290,258,156,273,230,151,150,272,203,184,267,196,226,252,299,218,266,148,176,199,229,148,165,210,287,279,148,117,275,117,113,228,191,223,125,197,241,100,275,224,264,104,245,272,197,295,278,292,287,257,143,218,269,297,266,290,224,256,142,140,231,235,298,160,224,156,100,102,201,275,217,298,289,275,274,243,253,196,127,236,142,219,175]
["Nissan Stanza",101,282,257,190,243,145,176,149,111,210,175,182,265,189,278,195,219,173,157,200,220,227,250,259,157,107,228,106,249,253,267,145,237,153,250,163,285,217,208,132,168,155,245,221,149,216,291,254,272,252,151,131,217,250,207,241,227,152,180,244,208,230,134,193,259,119,110,138,129,270,296,171,298,125,157,228,297,205,176,230,245,275,199,168]
["Nissan Sunny",299,139,168,200,276,171,212,121,223,253,173,147,241,152,217,161,224,220,102,210,200,124,108,121,122,194,199,188,210,183,137,206,170,217,176,204,119,283,152,158,175,145,293,170,260,108,126,143,248,245,199,115,150,271,246,121,249,243,300,247,297,161,111,188,155,159,174,178,242,195,281,206,109,297,237,294,118,228,222,199,241,265,243,155]
["Nissan Teana",263,279,281,196,115,204,188,115,192,192,109,274,101,152,216,186,246,266,151,178,201,154,243,151,269,283,214,283,263,220,105,147,188,169,183,121,189,183,106,287,128,155,212,170,264,130,160,137,299,290,214,104,250,114,112,179,129,216,235,194,147,250,207,108,125,275,147,119,206,183,183,114,170,185,102,120,131,238,159,140,259,195,221,154]
["Nissan Terrano",223,270,285,156,223,273,113,218,147,283,118,216,155,142,260,252,121,248,109,167,293,214,244,127,276,279,220,209,165,179,125,132,255,191,278,203,275,194,103,294,177,284,180,166,147,232,204,104,127,248,188,109,264,279,280,214,147,271,166,275,189,254,259,129,234,300,262,124,203,247,122,290,149,235,277,141,132,144,223,127,299,285,136,207]
["Nissan Tiida",134,226,241,204,250,220,269,261,155,229,146,190,173,190,277,142,216,170,299,133,112,173,268,190,222,120,294,239,136,127,183,109,242,212,260,249,232,145,222,240,192,273,221,199,188,300,234,296,153,250,183,163,234,216,197,109,123,102,252,273,230,293,242,292,101,151,271,145,280,217,154,131,292,207,275,147,108,116,263,142,211,124,204,140]
["Nissan Tino",222,100,216,121,290,187,117,180,130,174,134,154,104,261,116,204,104,230,285,242,240,118,191,274,279,166,224,112,254,270,294,205,164,264,256,189,122,130,180,153,160,274,277,252,145,117,119,265,230,225,116,214,145,255,159,162,252,200,185,184,266,121,228,159,221,119,289,238,232,182,236,263,216,293,116,150,252,114,267,192,102,111,183,121]
["Nissan Titan",135,229,106,223,179,118,268,271,236,254,272,175,258,264,278,225,186,259,141,265,235,221,234,172,134,119,148,155,243,191,273,165,109,118,160,289,242,234,215,227,291,295,116,192,277,184,223,164,101,145,118,165,219,292,252,197,104,114,166,295,197,204,249,222,166,286,126,285,196,176,103,233,297,167,126,180,101,281,243,126,300,118,284,116]
["Nissan Urvan",285,186,208,256,163,279,292,214,239,282,242,169,156,299,153,283,186,233,189,162,278,223,245,223,177,124,125,238,274,129,124,183,152,151,208,100,117,275,179,223,113,277,282,244,225,191,289,110,209,298,113,248,152,152,267,226,295,286,138,204,126,155,207,129,228,246,226,195,171,217,149,239,197,186,211,166,112,268,230,219,180,222,127,120]
["Nissan Vanette",105,219,280,171,206,181,172,188,287,295,276,235,256,287,188,204,279,181,123,255,172,258,264,265,180,218,129,196,135,126,188,220,139,129,199,118,132,119,268,178,251,214,192,107,206,163,265,170,123,261,257,257,145,221,151,238,226,162,210,122,253,159,190,194,244,158,181,286,175,243,169,203,209,192,187,169,219,177,130,158,188,260,281,253]
["Nissan Versa",100,214,262,178,109,166,259,222,280,104,279,271,269,134,251,159,105,114,229,246,116,102,183,175,114,265,226,186,222,245,276,115,216,166,233,173,103,192,289,287,107,231,241,156,186,187,279,223,223,300,274,271,163,298,250,151,266,243,120,116,209,219,224,118,219,102,182,101,159,275,148,179,252,179,207,201,214,230,195,166,246,220,246,210]
["Nissan Wingroad",215,230,271,172,243,274,241,148,153,268,184,297,221,256,293,253,213,258,236,187,142,129,211,139,194,112,195,202,263,178,203,140,259,226,295,195,105,249,194,246,103,100,218,282,132,231,123,209,130,262,289,136,202,143,108,179,244,126,126,142,283,299,142,164,161,164,257,279,261,276,268,243,251,252,129,217,111,108,148,185,204,151,254,227]
["Nissan Xterra",230,273,194,109,241,235,126,100,116,177,181,124,157,219,292,107,168,263,201,293,170,258,252,237,152,300,128,296,248,174,132,260,196,195,291,229,179,224,187,293,122,181,183,153,284,195,298,112,265,137,276,259,212,167,196,244,197,266,234,230,104,119,279,157,222,149,172,248,193,239,113,251,140,171,294,240,107,179,223,253,174,288,270,237]
["Nissan X-Trail",285,176,175,132,120,251,219,240,262,224,108,144,231,271,255,261,249,255,268,115,242,286,103,105,279,244,171,243,128,137,196,202,258,246,147,212,118,248,123,275,196,178,157,293,242,266,197,131,125,198,219,273,209,286,189,128,235,258,103,221,272,150,100,239,145,229,151,171,116,207,250,174,155,182,100,282,217,249,193,296,222,199,263,157]

{"sheet":"Honda","index":10,"n_rows":81,"n_cols":85,"rows_kept":81,"cut":false,"hidden":false,"merged":[]}
["Honda sells","2016-01-31","2016-02-28","2016-03-31","2016-04-30","2016-05-31","2016-06-30","2016-07-31","2016-08-31","2016-09-30","2016-10-31","2016-11-30","2016-12-31","2017-01-31","2017-02-28","2017-03-31","2017-04-30","2017-05-31","2017-06-30","2017-07-31","2017-08-31","2017-09-30","2017-10-31","2017-11-30","2017-12-31","2018-01-31","2018-02-28","2018-03-31","2018-04-30","2018-05-31","2018-06-30","2018-07-31","2018-08-31","2018-09-30","2018-10-31","2018-11-30","2018-12-31","2019-01-31","2019-03-01","2019-03-31","2019-04-30","2019-05-31","2019-06-30","2019-07-31","2019-08-31","2019-09-30","2019-10-31","2019-11-30","2019-12-31","2020-01-31","2020-02-28","2020-03-31","2020-04-30","2020-05-31","2020-06-30","2020-07-31","2020-08-31","2020-09-30","2020-10-31","2020-11-30","2020-12-31","2021-01-31","2021-02-28","2021-03-31","2021-04-30","2021-05-31","2021-06-30","2021-07-31","2021-08-31","2021-09-30","2021-10-31","2021-11-30","2021-12-31","2022-01-31","2022-02-28","2022-03-31","2022-04-30","2022-05-31","2022-06-30","2022-07-31","2022-08-31","2022-09-30","2022-10-31","2022-11-30","2022-12-31"]
["Honda Accord",50,157,73,122,241,96,138,74,289,92,288,167,252,265,273,186,123,76,136,182,169,109,128,219,197,166,207,282,196,192,104,138,52,170,94,157,199,85,287,98,163,171,258,122,133,181,238,206,137,236,224,196,230,257,194,82,247,182,130,142,285,143,75,255,288,179,170,97,141,162,261,59,57,82,74,145,88,160,100,66,234,270,102,257]
["Honda Accord Coupe",284,125,195,104,115,268,217,76,89,289,100,66,133,97,65,68,117,252,263,71,152,208,223,107,113,52,158,146,68,134,164,103,229,216,261,210,125,237,89,82,162,129,274,246,82,275,269,219,98,142,130,108,120,232,214,200,133,96,64,68,79,153,225,241,160,214,81,135,186,102,140,91,105,169,130,118,91,107,241,274,267,255,105,246]
["Honda Accord Euro R",171,58,258,195,160,205,260,173,194,51,80,262,80,163,159,89,254,88,103,178,107,151,235,281,233,72,97,216,51,261,211,200,193,142,215,191,265,242,119,175,193,219,197,284,124,148,217,269,271,191,86,280,269,102,165,261,70,168,173,105,234,107,182,229,56,193,127,285,278,165,54,213,207,272,196,277,68,235,235,124,281,289,177,179]
["Honda Accord Type R",88,125,129,244,77,137,59,217,281,205,129,242,255,219,82,198,234,128,163,200,263,251,234,65,254,289,244,143,252,84,98,103,243,143,94,274,56,272,189,186,202,221,238,112,133,135,282,242,267,182,270,158,212,272,57,141,193,263,90,178,148,157,287,65,255,88,289,155,113,62,234,75,195,84,216,264,67,242,228,271,196,279,90,51]
["Honda Accord Wagon",232,262,171,172,67,67,100,188,241,279,227,53,247,64,159,130,260,238,163,138,254,134,67,230,251,54,65,132,54,275,183,179,95,272,168,53,176,186,87,168,93,74,82,54,110,275,202,97,74,69,253,147,69,203,97,130,203,90,218,210,284,84,280,121,154,67,131,137,251,245,57,284,66,60,105,233,198,172,106,222,165,121,219,210]
["Honda Airwave",69,246,121,106,179,141,190,228,212,208,289,265,153,186,54,226,219,125,254,269,86,97,106,278,89,270,277,221,271,228,282,180,148,182,112,69,191,259,175,149,216,114,62,203,125,91,146,274,69,136,85,286,127,223,275,107,131,95,75,67,58,268,203,165,111,218,60,123,189,108,127,233,222,217,131,219,227,91,137,242,153,274,213,191]
["Honda Ascot",136,281,83,73,179,137,260,238,104,91,86,169,120,61,250,212,197,79,183,215,209,233,198,122,82,136,223,131,82,138,77,265,138,235,137,127,280,214,221,215,136,78,176,104,178,159,149,188,191,211,246,176,173,252,92,94,107,277,127,259,285,189,58,273,186,52,209,184,200,170,224,173,141,255,218,276,210,228,184,275,91,229,253,111]
["Honda Ascot Innova",60,177,129,91,289,245,97,232,107,231,58,283,281,69,262,121,123,116,91,229,124,137,239,62,189,52,75,185,168,249,282,107,160,284,124,223,232,271,107,102,239,54,239,94,262,55,233,64,208,72,71,276,267,72,278,227,85,66,185,236,174,284,287,206,61,137,156,278,101,64,205,171,289,274,264,221,225,61,129,91,124,280,256,161]
["Honda Avancier",161,57,266,245,145,97,288,73,110,277,258,74,288,52,110,170,167,253,217,199,120,76,247,133,82,74,53,158,125,145,254,118,192,270,172,286,68,228,133,154,142,120,64,229,249,106,258,177,51,199,204,264,182,100,128,230,181,149,93,220,161,82,159,58,72,273,112,164,286,106,162,192,62,73,95,68,275,177,232,63,259,194,184,126]
["Honda Ballade",204,121,219,145,91,121,141,239,52,224,288,133,144,110,159,264,57,188,58,162,272,119,178,272,242,242,57,182,77,123,169,66,290,243,103,259,220,248,82,216,66,98,68,289,267,278,112,161,111,112,211,242,92,196,158,131,68,284,174,133,210,196,63,221,264,210,290,179,129,133,64,103,201,61,212,65,162,176,244,64,77,74,254,203]
["Honda Beat",148,230,215,62,97,222,87,120,166,94,256,216,198,211,81,158,154,211,231,109,207,88,197,147,140,143,59,274,135,147,181,275,76,112,75,152,198,135,220,61,207,144,208,157,227,266,78,227,200,260,270,170,230,221,231,141,83,176,80,126,183,216,174,146,94,166,115,159,237,50,145,185,213,275,223,260,205,126,185,273,249,80,282,158]
["Honda Capa",53,71,172,67,212,89,68,210,279,171,239,171,199,227,228,83,221,259,238,100,236,200,191,277,220,110,172,105,223,77,118,126,250,221,266,164,250,259,207,129,249,116,96,214,186,254,202,153,75,189,123,263,167,235,186,213,256,204,119,53,114,285,205,56,236,270,98,61,124,105,142,178,221,213,138,167,120,247,260,206,143,162,280,117]
["Honda City",268,151,141,78,186,101,122,108,157,88,79,232,66,154,238,109,152,128,62,61,71,105,215,177,144,184,236,120,135,170,138,164,163,115,258,158,255,153,221,197,202,145,116,144,243,83,162,143,165,264,192,274,223,80,160,266,72,201,184,110,256,259,81,85,228,143,157,185,224,51,178,61,233,140,274,55,179,212,116,97,77,62,117,81]
["Honda Civic",277,112,90,252,267,117,249,128,203,90,99,263,258,198,135,78,128,226,77,206,76,174,55,62,197,239,167,122,70,139,189,255,88,254,85,229,217,58,132,96,232,76,158,219,261,182,243,170,155,268,113,197,241,172,232,109,145,168,280,251,213,128,236,176,96,95,253,61,54,208,107,251,124,128,245,268,67,71,60,170,202,201,108,153]
["Honda Civic Coupe",223,88,202,233,197,225,120,77,111,110,126,198,235,242,120,106,272,51,227,237,249,186,290,76,150,199,104,101,97,63,188,247,59,76,63,139,197,78,286,284,283,108,92,97,272,131,193,54,87,121,290,287,169,199,140,79,65,227,104,152,205,68,157,241,158,269,129,208,146,91,222,123,109,244,263,139,266,231,288,220,165,80,177,267]
["Honda Civic Fastback",138,158,205,142,236,188,255,150,213,243,187,95,233,154,101,279,66,67,193,117,243,200,200,277,124,218,155,229,283,95,247,91,166,212,247,98,68,209,193,127,251,100,184,62,248,74,149,87,140,279,193,152,201,222,248,130,54,172,62,92,110,64,97,81,53,287,189,151,77,263,198,101,100,142,176,203,257,262,230,235,289,165,256,287]
["Honda Civic Hatchback",189,218,77,85,169,189,164,289,152,71,234,264,204,156,163,277,163,59,64,181,79,121,229,259,104,188,50,55,267,276,217,196,150,258,247,186,199,246,225,197,100,152,121,94,195,221,260,204,124,128,107,250,128,144,202,199,202,115,253,206,254,208,53,187,102,219,255,138,113,226,284,70,222,78,166,281,61,205,200,230,263,275,220,248]
["Honda Civic Hybrid",55,200,280,249,168,142,149,258,149,81,273,116,239,72,199,137,280,137,226,127,231,266,55,257,263,276,132,261,78,113,124,193,172,56,192,195,190,231,263,203,93,102,157,262,153,224,100,146,149,281,210,104,275,128,112,59,73,264,157,206,232,164,142,240,84,84,133,196,276,103,151,204,242,139,56,249,74,266,123,193,107,264,108,77]
["Honda Civic Si",225,287,172,127,195,189,130,229,133,225,208,90,187,71,99,221,278,132,256,221,233,232,94,178,259,114,176,76,263,130,171,199,285,264,169,244,222,156,212,244,208,61,252,154,171,277,239,85,258,259,142,186,82,78,76,103,285,231,87,194,108,167,192,99,115,134,126,71,158,260,167,107,234,170,171,167,128,160,218,239,97,78,189,259]
["Honda Civic Type R",273,166,169,267,270,116,60,148,108,51,270,275,77,212,91,140,288,276,283,158,282,276,134,121,158,157,167,200,54,90,172,247,79,221,224,253,200,143,246,65,127,88,229,61,244,175,283,160,285,281,176,142,52,207,76,91,275,220,102,79,286,82,262,234,75,123,258,70,260,216,222,111,235,202,254,226,96,141,150,177,100,231,80,120]
["Honda Civic Wagon",104,173,162,193,169,130,97,200,61,250,264,135,186,156,78,226,57,68,248,142,71,122,76,92,51,229,178,208,283,182,274,165,52,284,266,152,196,139,285,191,165,168,146,225,202,119,114,174,130,206,99,154,56,176,243,65,124,104,74,172,278,62,214,237,73,161,53,242,256,66,80,86,254,216,242,236,59,107,150,69,53,134,127,147]
["Honda Concerto",208,278,148,228,235,276,143,254,201,212,65,232,280,154,127,174,182,114,224,241,263,288,274,255,79,114,151,72,270,52,269,54,216,125,146,101,245,210,276,99,209,180,180,50,149,98,145,68,139,256,154,107,273,92,71,143,149,211,132,69,222,253,228,67,127,223,86,210,131,100,262,264,139,244,61,254,243,254,94,222,284,90,214,197]
["Honda Crossroad",241,168,177,99,114,221,151,207,99,180,164,132,100,163,54,215,56,94,151,115,234,277,184,229,111,63,236,286,54,122,284,94,182,229,264,83,122,215,104,95,64,223,178,83,91,80,147,141,68,122,129,200,90,173,236,103,228,276,185,114,122,203,280,66,226,193,217,161,274,172,281,195,183,273,164,222,259,267,133,264,260,282,60,225]
["Honda Crosstour",285,282,219,74,127,115,272,168,124,183,187,229,74,171,159,125,223,259,222,175,210,216,68,76,139,114,168,86,97,111,138,130,156,111,95,165,213,113,139,219,171,208,221,85,167,66,122,94,202,66,151,187,112,69,179,266,108,154,189,97,190,240,172,53,194,99,67,234,176,289,287,252,117,122,259,149,182,152,156,160,132,82,288,237]
["Honda CR-V",169,70,265,196,137,65,270,168,74,152,156,56,88,130,90,116,253,289,161,105,220,200,135,180,137,243,168,281,229,290,110,78,165,159,61,56,243,83,213,228,62,122,274,114,227,231,220,259,96,199,250,64,194,98,176,269,269,163,84,52,233,210,211,76,216,263,174,89,103,139,81,144,216,168,165,214,244,219,155,259,280,146,200,147]
["Honda CR-X",157,183,256,164,276,207,157,64,150,242,239,148,222,284,188,92,65,287,69,132,201,70,278,70,209,270,199,100,263,221,193,210,202,228,245,66,188,221,283,171,252,255,160,159,201,245,247,236,77,87,138,211,65,184,163,272,129,165,50,282,182,233,254,283,283,104,70,208,282,239,159,206,134,257,113,279,124,115,175,228,126,61,160,187]
["Honda CR-X Del Sol",239,170,158,195,77,145,268,53,156,91,252,234,240,277,186,283,106,113,258,237,171,252,222,159,209,269,120,245,63,73,224,280,242,146,104,261,202,138,87,58,111,98,71,50,51,97,76,63,262,80,268,111,241,80,273,201,279,176,290,165,113,179,221,185,105,173,243,168,273,181,134,79,170,221,133,137,185,162,281,285,95,71,187,170]
["Honda CR-Z",157,183,192,141,264,66,94,143,248,185,248,68,198,55,221,267,246,215,204,229,262,114,273,196,81,76,165,164,248,104,134,152,78,128,219,239,202,64,261,129,58,86,173,166,193,123,223,83,239,108,100,165,193,198,166,222,234,275,137,196,89,256,264,160,107,190,245,246,103,142,156,261,277,200,252,271,50,165,219,127,221,143,105,117]
["Honda Domani",127,142,60,186,147,264,279,115,224,196,264,73,243,200,153,145,171,209,185,155,84,273,254,149,153,98,116,290,74,137,91,263,135,101,267,88,276,94,108,282,250,122,243,203,274,101,128,105,84,155,128,233,272,124,201,184,238,288,114,208,193,182,264,184,256,268,111,162,151,287,106,200,79,250,141,245,71,155,220,172,242,255,209,152]
["Honda Edix",273,282,168,198,105,166,118,233,204,116,262,200,264,128,246,54,131,127,157,136,171,195,232,143,57,145,84,172,81,200,224,242,215,247,280,227,116,128,262,166,84,128,152,105,149,260,93,245,122,249,140,223,70,201,268,134,72,279,142,208,283,235,145,78,52,163,146,59,50,123,200,55,57,185,78,109,188,105,198,60,111,148,131,211]
["Honda Element",154,244,73,59,230,66,75,201,151,104,246,201,204,144,118,191,219,166,181,55,79,229,289,253,148,261,236,280,99,68,64,73,231,263,203,269,250,141,70,96,205,66,245,134,156,121,254,268,127,151,104,222,183,105,260,117,151,211,284,182,211,96,246,203,105,252,91,81,240,228,277,112,220,182,207,284,210,228,228,165,50,221,180,94]
["Honda Elysion",173,133,212,202,145,102,226,274,88,217,184,55,212,202,187,125,210,109,228,226,158,152,79,246,114,198,117,260,235,210,205,202,98,114,244,71,224,59,115,280,254,178,281,275,247,166,130,286,157,116,252,245,288,100,71,195,237,82,84,284,144,189,51,68,261,260,83,256,114,66,86,212,274,82,69,108,223,255,280,175,218,226,280,211]
["Honda Fit",280,255,78,188,120,198,52,127,183,187,284,156,97,195,129,91,275,89,80,155,290,117,129,68,288,289,272,146,99,211,78,115,125,58,286,261,160,199,75,245,134,211,193,232,115,101,153,78,159,145,108,191,73,162,276,175,190,81,124,220,131,190,192,251,229,206,284,144,269,87,257,154,252,56,95,135,140,127,244,122,117,289,108,156]
["Honda Fit Aria",65,57,182,215,247,181,274,275,155,233,151,284,75,183,101,270,232,171,129,81,274,133,161,98,188,150,244,115,135,172,215,186,84,228,85,56,280,87,54,238,86,73,284,204,287,121,216,114,223,249,289,220,60,246,198,254,88,172,170,280,115,219,180,248,182,143,100,274,188,141,283,189,125,258,162,83,197,124,57,180,125,125,150,61]
["Honda Freed",188,94,129,165,154,262,177,106,177,283,76,69,137,138,269,115,202,210,170,285,189,52,235,81,82,75,283,103,140,153,256,121,177,206,75,221,112,235,282,145,60,276,107,201,194,242,281,216,153,250,155,205,260,243,223,162,130,153,50,121,242,63,78,101,215,147,97,148,207,105,228,134,98,108,141,74,71,192,269,110,107,181,269,174]
["Honda FR-V",135,263,202,89,60,136,241,176,271,262,126,78,70,263,193,64,87,86,192,162,171,96,146,239,189,266,267,120,282,95,266,80,144,87,284,156,92,149,153,114,86,153,89,261,265,92,200,138,121,278,95,192,219,105,140,57,284,167,207,130,166,159,207,135,281,115,84,287,75,164,50,84,161,143,210,60,177,214,167,136,64,104,107,242]
["Honda HR-V",175,115,160,132,153,69,290,147,110,94,80,207,269,232,55,278,256,143,68,240,179,140,245,128,126,272,158,105,138,58,61,232,185,224,192,199,280,188,95,164,250,287,288,165,199,246,62,84,276,208,194,259,214,250,54,254,226,134,228,152,272,176,205,265,289,108,72,272,154,217,80,117,168,157,187,203,145,161,182,174,238,230,97,89]
["Honda Insight",81,246,118,222,162,192,181,270,271,61,220,240,159,211,78,173,142,150,252,61,94,111,280,284,252,193,136,169,222,198,136,195,114,239,181,139,194,174,91,110,256,275,59,139,174,138,238,91,66,190,110,84,70,200,227,96,153,181,126,120,154,141,260,68,230,284,184,236,201,60,271,263,206,136,198,281,270,172,235,52,89,57,131,124]
["Honda Inspire",273,89,210,52,250,71,272,263,244,219,175,278,177,206,184,55,170,96,183,90,144,239,193,205,193,203,54,174,117,152,239,245,249,167,237,230,274,147,105,271,211,115,263,55,57,221,158,137,130,159,142,180,170,237,198,269,241,276,156,146,79,142,261,122,91,231,137,121,244,190,182,155,279,172,133,76,57,268,118,253,50,70,284,242]
["Honda Integra",172,240,259,136,263,107,102,152,233,210,108,159,202,139,155,147,241,56,57,154,161,281,57,54,288,91,56,262,268,188,159,256,105,65,186,68,249,194,178,175,158,255,92,50,162,78,78,251,225,211,200,266,61,95,54,181,277,175,229,99,191,284,166,209,148,177,151,289,52,134,233,88,216,215,80,144,94,95,71,222,99,157,110,89]
["Honda Integra Quint",137,62,258,235,204,169,271,213,209,210,229,215,51,256,258,116,76,215,78,216,158,96,122,175,151,287,53,99,265,202,219,79,245,99,172,224,219,115,262,267,221,110,113,130,180,131,137,102,224,282,155,169,57,216,229,276,158,178,241,254,240,157,213,168,215,112,138,124,269,280,224,177,98,73,89,102,268,180,183,73,141,164,152,257]
["Honda Integra SJ",58,120,192,242,259,92,113,192,105,114,154,157,225,144,153,99,234,211,125,241,221,180,241,209,279,59,53,209,223,168,89,255,195,88,213,260,200,265,252,148,59,107,151,194,176,186,275,121,189,214,258,218,139,164,152,194,280,152,98,216,210,209,113,184,153,258,238,176,73,243,179,244,187,245,56,119,73,223,98,144,155,228,58,208]
["Honda Integra Type R",129,276,284,276,214,104,150,229,213,151,148,132,84,240,215,115,289,197,185,85,191,174,107,190,62,224,138,58,283,220,108,52,175,160,280,244,81,152,284,281,144,236,139,232,265,214,231,114,190,144,60,127,111,80,259,279,271,139,192,98,180,115,239,190,247,249,184,226,88,235,204,152,257,103,110,276,124,54,66,78,173,265,250,247]
["Honda Integra Type R Sedan",151,56,206,158,285,195,126,198,54,265,265,157,181,278,68,72,257,163,202,243,210,50,72,157,157,140,233,176,188,274,222,281,274,200,126,68,114,113,141,224,151,235,165,272,152,108,98,173,59,193,200,120,174,229,237,83,273,267,264,205,71,116,122,216,187,135,59,75,210,190,220,167,95,72,98,66,94,189,88,50,272,224,146,185]
["Honda Jazz",212,193,102,285,82,163,191,116,143,121,68,240,111,228,137,235,271,235,77,105,210,196,199,217,128,171,216,233,219,178,234,270,110,238,289,158,232,155,65,228,159,178,173,60,122,157,279,70,275,110,288,200,208,117,244,202,108,57,217,227,235,260,87,253,61,201,131,176,192,166,185,276,145,132,78,186,253,257,220,124,54,285,107,260]
["Honda Legend",289,146,140,171,183,140,94,142,271,249,146,188,256,150,198,272,127,179,198,193,210,228,80,207,51,128,221,260,215,75,207,238,230,201,221,226,115,101,165,125,54,205,286,242,100,261,112,138,232,71,64,125,214,202,112,78,239,287,186,198,223,158,163,60,142,234,119,271,93,116,135,162,180,78,127,194,289,223,97,254,188,154,88,57]
["Honda Life",59,250,270,275,133,127,92,225,50,63,107,141,218,91,51,257,70,163,180,141,213,74,217,269,103,218,253,231,261,277,70,245,116,144,118,85,162,132,83,127,186,256,162,147,115,118,286,214,223,66,109,102,86,125,174,149,64,258,218,106,275,130,185,245,206,118,194,216,284,275,242,182,128,71,153,87,68,238,157,56,211,105,95,60]
["Honda Life Dunk",186,268,78,275,82,146,159,132,112,273,233,63,161,197,250,85,149,172,290,81,222,237,164,88,128,244,279,178,135,189,257,273,271,137,90,185,178,127,88,269,158,52,104,262,157,97,265,254,285,223,94,224,233,269,92,272,53,77,93,50,218,240,200,244,176,114,99,180,58,268,232,161,280,232,130,126,231,57,113,160,231,149,111,125]
["Honda Logo",137,110,231,143,148,67,57,211,156,282,248,188,80,214,158,70,199,218,129,92,161,271,264,53,249,107,54,150,166,169,207,92,75,148,259,73,258,64,83,106,209,58,66,255,181,206,126,271,70,122,191,187,100,92,191,51,235,275,277,165,184,55,262,203,248,156,166,220,162,150,269,159,109,120,88,101,285,58,248,110,134,243,273,239]
["Honda Mobilio",61,252,278,243,78,194,159,217,259,122,271,266,74,125,123,169,96,265,170,269,79,213,69,163,194,277,162,132,288,237,188,197,279,79,244,271,134,223,231,208,117,181,280,144,248,234,264,263,186,178,83,219,249,122,239,212,276,217,231,218,56,212,93,218,134,244,76,157,119,100,98,283,53,108,139,171,216,110,187,164,248,215,197,140]
["Honda Mobilio Spike",72,245,213,105,187,133,259,81,179,125,80,176,289,263,290,114,125,230,235,240,102,240,168,223,75,250,250,269,285,277,64,133,213,258,135,212,78,271,64,85,139,52,239,249,56,202,139,252,91,151,184,202,246,228,272,84,276,151,92,226,153,98,202,107,217,110,88,161,211,271,194,136,263,122,155,70,280,209,199,188,124,159,251,97]
["Honda NSX",170,145,109,134,194,108,160,116,237,269,174,157,176,72,173,69,216,61,65,55,114,176,228,64,103,210,147,187,166,193,247,91,184,107,252,242,226,107,75,230,87,199,111,124,87,168,173,222,118,52,242,194,118,128,107,176,176,205,124,146,148,246,185,268,169,210,250,122,71,203,168,177,160,218,78,197,53,79,90,226,86,133,271,232]
["Honda Odyssey",290,160,200,89,179,102,177,185,232,142,217,153,175,186,289,84,60,96,131,96,236,81,213,245,131,282,114,87,275,232,122,285,260,52,120,283,238,115,104,256,279,174,259,271,193,121,270,245,60,181,102,86,178,288,262,234,205,202,200,254,81,286,126,84,107,93,290,204,182,219,218,87,151,286,220,155,152,245,104,178,230,202,128,208]
["Honda Orthia",178,168,58,105,290,67,217,283,181,218,111,276,233,125,81,143,64,290,233,267,255,88,278,166,205,156,135,184,208,113,271,269,72,238,155,158,222,247,104,235,106,177,147,163,280,122,142,287,64,193,275,261,106,117,125,215,263,53,153,214,62,100,214,94,222,144,134,70,272,266,93,194,169,160,58,265,290,290,192,159,243,67,142,229]
["Honda Partner",225,145,244,171,51,205,267,118,55,64,283,176,167,129,237,137,214,136,288,283,197,272,151,124,147,213,196,259,255,165,92,214,272,238,81,65,177,95,161,235,64,230,102,147,141,155,154,263,63,234,284,116,178,213,247,131,284,213,59,187,98,156,227,261,272,170,116,192,119,190,271,181,70,243,66,254,253,240,258,211,171,243,95,50]
["Honda Passport",181,76,188,231,139,290,286,110,160,245,99,58,157,125,80,275,227,271,166,278,139,125,155,197,290,285,150,60,290,155,88,286,117,178,77,247,92,119,161,173,277,86,83,272,242,125,63,160,60,257,173,218,94,207,177,167,260,220,168,106,184,51,76,193,253,239,93,110,162,253,97,160,92,280,63,203,140,271,76,181,193,199,150,179]
["Honda Pilot",51,239,280,163,175,286,110,101,245,172,78,74,215,214,127,176,94,69,185,72,113,241,180,70,283,217,268,286,153,72,112,70,202,248,236,239,188,191,68,176,104,64,220,65,271,155,103,115,112,172,186,258,210,91,61,112,50,59,113,225,93,284,77,202,200,93,119,193,273,180,244,243,259,75,71,90,114,191,106,158,186,227,127,73]
["Honda Prelude",79,219,173,178,79,69,235,259,194,284,268,137,87,232,53,141,136,77,101,92,80,180,263,205,56,244,191,78,287,194,100,266,113,116,204,286,167,114,129,73,244,199,61,287,127,124,177,189,110,288,289,114,255,160,92,199,87,101,131,242,55,255,184,241,60,236,98,139,210,179,224,101,175,211,201,124,229,182,135,110,114,163,265,138]
["Honda Quintet",198,246,143,99,116,100,232,107,151,65,287,99,226,64,179,233,105,110,137,182,106,68,197,200,196,139,75,112,285,206,118,247,191,57,238,274,163,248,186,288,261,177,246,93,81,179,93,290,95,125,199,104,274,259,85,156,237,164,157,195,116,82,266,153,165,64,252,83,136,68,180,277,118,214,89,141,281,264,197,74,234,77,89,272]
["Honda Rafaga",265,85,178,135,114,125,223,124,249,200,123,205,108,284,278,146,154,75,85,208,221,279,114,188,106,82,156,239,167,281,203,82,273,254,189,216,113,214,77,102,109,272,90,147,63,274,128,196,73,181,279,178,69,79,238,57,240,204,201,64,192,57,72,209,223,237,137,270,154,121,229,73,221,103,288,265,197,197,63,122,61,104,133,179]
["Honda Ridgeline",84,56,233,276,163,183,78,105,275,68,275,62,233,281,262,133,93,171,184,152,152,141,245,108,153,160,178,149,283,157,168,162,131,213,235,62,118,269,98,81,198,223,131,262,103,133,77,98,177,125,207,201,97,287,278,215,221,242,201,65,128,236,104,287,88,161,151,244,89,237,75,288,216,189,272,196,88,160,175,193,275,273,116,237]
["Honda S2000",192,83,136,222,120,81,181,227,253,187,277,275,160,63,255,240,68,152,119,267,58,179,219,69,253,79,196,150,224,59,96,114,52,272,257,72,132,259,282,270,151,232,185,174,226,275,150,103,73,262,183,238,234,264,73,168,141,170,202,236,187,241,83,58,188,167,266,204,236,231,290,97,120,50,114,125,274,238,266,212,225,102,74,93]
["Honda Saber",265,88,165,66,270,260,70,277,269,289,110,230,232,172,156,268,145,217,247,242,150,92,215,147,209,124,215,161,285,270,192,271,177,262,84,174,290,258,244,283,225,220,213,76,54,264,240,246,52,221,271,279,157,143,71,161,59,226,265,125,170,154,223,192,198,153,183,69,183,175,213,169,169,123,271,238,229,243,83,128,128,164,277,176]
["Honda Shuttle",131,142,226,210,222,176,116,110,223,233,213,116,89,73,236,240,62,229,171,173,158,238,222,67,91,107,161,174,253,245,241,232,232,179,222,94,264,123,200,242,64,259,220,278,83,165,215,197,218,99,238,64,199,54,140,108,211,235,141,164,132,181,100,251,249,290,231,139,238,68,119,149,96,125,232,243,269,168,267,270,109,182,85,59]
["Honda S-MX",127,270,283,111,74,216,156,117,61,289,216,246,256,283,173,73,92,183,210,157,246,123,251,86,146,258,55,218,258,178,71,86,98,173,82,87,58,222,151,278,206,278,263,165,137,140,168,67,61,217,83,248,97,109,188,109,235,140,160,233,273,123,75,82,240,219,242,72,86,189,68,101,113,233,132,125,212,83,132,201,223,75,145,202]
["Honda Stepwgn",58,176,208,269,183,78,215,183,124,187,131,283,138,158,191,152,134,88,142,179,65,95,231,69,123,199,288,87,72,236,78,163,261,222,114,199,139,289,77,281,82,225,250,288,286,154,270,99,84,86,232,60,263,133,212,95,155,275,171,218,278,98,79,266,131,229,270,215,207,216,203,261,84,115,65,174,224,266,272,258,191,160,181,79]
["Honda Stream",244,287,147,109,53,234,190,238,142,64,157,62,269,247,248,277,194,92,228,133,123,89,268,248,217,56,244,92,191,138,62,207,261,255,283,273,158,134,119,261,89,230,246,289,81,206,204,170,56,177,68,210,169,82,71,178,233,263,218,249,266,92,63,161,126,224,125,224,104,75,85,149,146,68,151,150,248,136,128,277,195,133,138,134]
["Honda Street",94,284,128,157,96,250,190,129,202,172,130,57,195,72,164,258,91,160,272,86,50,122,284,223,65,79,100,193,61,241,216,202,197,273,161,172,161,94,247,161,281,217,176,137,111,283,166,202,68,119,132,270,82,208,280,165,270,62,149,53,80,228,201,204,281,286,261,287,246,82,140,132,54,81,54,227,94,160,256,119,181,117,53,283]
["Honda Thats",93,100,289,148,192,159,245,177,69,196,53,141,252,176,219,51,216,152,213,175,140,271,151,219,136,195,224,183,238,74,241,109,125,82,224,212,64,60,120,53,241,112,223,208,57,134,157,201,289,272,165,117,67,76,71,96,263,199,209,81,178,106,77,260,116,84,81,167,156,128,244,262,286,242,94,185,266,267,147,153,246,96,220,246]
["Honda Today",209,203,145,132,147,139,127,277,243,98,247,107,102,93,61,188,169,184,228,209,260,108,266,285,50,87,105,210,223,111,209,53,88,235,290,199,280,107,64,150,78,214,241,161,75,135,155,267,242,124,54,142,202,123,144,232,98,153,100,270,135,112,84,272,221,103,130,57,216,224,258,106,108,123,203,243,201,190,265,165,141,286,215,142]
["Honda Torneo",206,271,153,92,284,209,187,114,181,241,219,160,183,282,258,233,238,91,271,192,278,239,271,259,133,209,224,159,163,228,165,106,77,90,180,227,116,157,173,245,106,152,157,207,267,237,262,142,171,68,125,254,263,279,62,106,234,249,183,158,65,162,138,213,169,199,252,236,255,212,103,286,125,91,257,181,138,151,252,60,63,120,159,236]
["Honda Vamos",225,54,179,86,223,254,221,202,69,156,124,279,92,214,161,257,273,133,288,152,233,162,180,178,87,169,278,58,67,231,142,83,229,169,58,173,279,261,65,91,141,143,213,225,209,69,235,173,251,70,233,225,227,127,125,259,146,170,111,54,58,159,55,200,91,167,273,189,148,169,149,167,158,134,80,105,223,130,182,278,253,241,144,273]
["Honda Vamos Hobio",284,271,249,200,52,186,54,133,137,146,207,97,153,56,142,64,271,220,52,235,159,244,278,188,111,73,175,189,131,212,170,159,108,157,249,270,80,201,104,106,274,244,193,143,120,256,178,214,131,90,123,252,69,198,236,71,250,125,276,188,124,234,196,225,184,262,193,159,214,223,63,230,70,78,239,91,226,93,229,132,53,128,62,269]
["Honda Vezel",205,97,139,219,154,183,60,123,230,74,274,238,254,64,134,106,156,148,68,228,99,247,178,150,248,245,274,274,189,104,150,153,144,58,148,274,245,164,103,122,288,141,103,148,161,131,52,149,68,250,138,56,149,201,120,178,128,155,59,282,73,280,113,155,166,224,261,115,112,100,129,71,157,225,244,251,110,238,54,91,214,216,205,222]
["Honda Vigor",243,73,99,173,224,91,224,254,140,246,264,55,242,200,154,253,139,89,72,184,106,110,236,141,105,257,282,217,86,126,109,169,178,219,284,143,168,174,110,137,185,208,169,283,251,164,274,198,50,231,94,114,137,245,50,274,224,170,125,231,104,90,235,197,118,64,167,80,225,199,208,132,170,224,207,68,244,104,113,148,178,181,110,170]
["Honda Z",195,100,236,149,265,57,270,287,199,61,277,141,116,62,198,66,138,245,100,224,203,130,99,204,264,154,177,208,252,105,63,220,214,171,260,87,133,148,152,106,152,212,290,183,233,76,151,133,94,252,72,170,113,58,236,181,123,263,180,84,181,175,75,190,261,119,255,63,275,159,229,221,124,261,63,59,285,93,221,116,264,80,92,119]
["Honda Zest",211,254,200,142,164,177,263,90,82,204,242,242,135,203,66,268,241,248,84,220,231,270,173,238,261,92,210,73,226,286,74,205,133,207,282,68,269,277,126,204,184,111,230,228,90,83,247,262,191,133,191,95,247,223,183,189,158,275,107,238,155,235,92,138,102,179,59,253,221,281,259,167,107,208,164,238,215,182,230,51,230,93,201,138]
[]
[]
[null,{"$f":"DATE(YEAR(B1)+7,MONTH(B1),DAY(B1))","v":"2023-01-31"},{"$f":"DATE(YEAR(C1)+7,MONTH(C1),DAY(C1))","v":"2023-02-28"},"2023-03-31","2023-04-30","2023-05-31","2023-06-30","2023-07-31","2023-08-31","2023-09-30","2023-10-31","2023-11-30","2023-12-31","2024-01-31","2024-02-28","2024-03-31","2024-04-30","2024-05-31","2024-06-30","2024-07-31","2024-08-31","2024-09-30","2024-10-31","2024-11-30","2024-12-31","2025-01-31","2025-02-28","2025-03-31","2025-04-30","2025-05-31","2025-06-30","2025-07-31","2025-08-31","2025-09-30","2025-10-31","2025-11-30","2025-12-31","2026-01-31","2026-03-01","2026-03-31","2026-04-30","2026-05-31","2026-06-30","2026-07-31","2026-08-31","2026-09-30","2026-10-31","2026-11-30","2026-12-31","2027-01-31","2027-02-28","2027-03-31","2027-04-30","2027-05-31","2027-06-30","2027-07-31","2027-08-31","2027-09-30","2027-10-31","2027-11-30","2027-12-31","2028-01-31","2028-02-28","2028-03-31","2028-04-30","2028-05-31",{"$f":"DATE(YEAR(BO1)+7,MONTH(BO1),DAY(BO1))","v":"2028-06-30"},"2028-07-31","2028-08-31","2028-09-30","2028-10-31","2028-11-30","2028-12-31","2029-01-31","2029-02-28","2029-03-31","2029-04-30","2029-05-31","2029-06-30","2029-07-31","2029-08-31","2029-09-30","2029-10-31","2029-11-30","2029-12-31"]

{"sheet":"Ford","index":11,"n_rows":81,"n_cols":85,"rows_kept":81,"cut":false,"hidden":false,"merged":[]}
["Ford sells","2016-01-31","2016-02-28","2016-03-31","2016-04-30","2016-05-31","2016-06-30","2016-07-31","2016-08-31","2016-09-30","2016-10-31","2016-11-30","2016-12-31","2017-01-31","2017-02-28","2017-03-31","2017-04-30","2017-05-31","2017-06-30","2017-07-31","2017-08-31","2017-09-30","2017-10-31","2017-11-30","2017-12-31","2018-01-31","2018-02-28","2018-03-31","2018-04-30","2018-05-31","2018-06-30","2018-07-31","2018-08-31","2018-09-30","2018-10-31","2018-11-30","2018-12-31","2019-01-31","2019-03-01","2019-03-31","2019-04-30","2019-05-31","2019-06-30","2019-07-31","2019-08-31","2019-09-30","2019-10-31","2019-11-30","2019-12-31","2020-01-31","2020-02-28","2020-03-31","2020-04-30","2020-05-31","2020-06-30","2020-07-31","2020-08-31","2020-09-30","2020-10-31","2020-11-30","2020-12-31","2021-01-31","2021-02-28","2021-03-31","2021-04-30","2021-05-31","2021-06-30","2021-07-31","2021-08-31","2021-09-30","2021-10-31","2021-11-30","2021-12-31","2022-01-31","2022-02-28","2022-03-31","2022-04-30","2022-05-31","2022-06-30","2022-07-31","2022-08-31","2022-09-30","2022-10-31","2022-11-30","2022-12-31"]
["Ford Aerostar",752,654,1147,1107,1039,808,911,1185,789,637,656,629,1143,797,787,1089,772,999,530,1006,1131,843,972,717,948,978,1108,1151,1162,662,1007,703,505,549,953,718,716,697,1152,1016,1051,983,953,928,518,1116,1127,1147,604,1176,683,814,660,641,937,602,939,995,756,822,631,1156,1028,686,874,968,1005,883,970,978,856,1136,583,725,581,840,753,730,814,749,624,1074,1194,1029]
["Ford Aspire",705,1017,1052,597,1052,761,1033,984,596,798,701,1026,930,518,749,542,1129,1076,962,552,645,1073,538,1133,609,1012,746,1111,1136,733,753,568,1027,582,1182,1145,1093,1196,608,1064,853,1112,819,607,1036,881,1092,911,772,888,1200,633,549,921,941,746,1062,867,848,889,970,687,1189,985,1100,1085,1194,747,1044,1107,1099,599,627,566,1151,552,823,1163,1020,767,537,1060,532,524]
["Ford B-Max",639,822,653,700,611,610,757,670,655,930,826,759,865,1039,1032,715,818,867,515,846,727,688,1187,698,759,1104,616,546,731,773,1101,1039,824,975,822,615,866,819,865,972,726,901,982,1071,824,1057,925,1092,917,712,1177,579,803,985,965,1080,818,810,1019,563,943,778,1180,1062,847,584,750,999,1101,1064,885,672,878,506,1196,548,500,714,669,618,1009,558,954,715]
["Ford Bronco",845,1023,1057,624,622,806,1075,1006,1174,630,746,1025,554,1082,1084,1140,921,709,1049,947,601,1110,995,985,1065,694,785,995,991,1170,717,934,546,1107,1045,512,880,689,1111,532,902,1174,1065,911,859,776,593,968,765,633,814,1116,895,978,1109,603,851,811,948,731,1078,896,636,916,809,871,1042,1087,950,767,936,1086,790,579,558,716,924,1015,717,559,974,511,1190,814]
["Ford Capri",844,893,829,884,740,590,1122,873,754,739,1138,558,1124,891,749,602,550,1144,535,960,1010,767,779,632,954,1151,1010,926,1121,1069,961,925,512,1047,875,1185,657,681,902,1136,538,709,1151,574,728,865,962,727,986,939,515,1134,596,1159,901,747,944,1182,888,1155,906,1085,1086,606,656,990,940,966,645,1107,999,822,1168,1056,992,608,772,525,985,920,1105,776,1163,915]
["Ford C-Max",873,576,1033,1134,604,583,985,857,512,1064,812,730,1103,924,762,904,1111,1181,729,1056,724,855,1126,567,1091,532,1069,1165,781,531,759,1164,512,741,647,852,859,545,1006,819,710,963,654,801,587,889,1084,1026,885,954,879,904,839,731,869,924,818,1079,1079,1055,717,726,1007,883,698,1108,656,943,1017,678,1091,975,525,1089,853,908,715,954,977,633,1142,947,855,677]
["Ford Consul",874,626,923,644,923,1077,906,645,1012,1009,1077,1023,963,767,539,1016,1171,1104,686,1172,603,843,596,1117,697,800,500,900,971,1136,778,782,683,1018,1084,1148,1182,927,816,879,933,607,1017,710,589,596,724,1000,665,1158,514,1094,1141,713,967,771,1136,866,966,827,634,547,824,511,614,927,740,758,882,538,516,766,804,977,541,1151,1058,1147,704,831,1197,1161,939,1124]
["Ford Contour",1147,614,687,614,700,1052,938,527,1101,897,699,875,897,566,672,685,938,1146,559,727,818,1144,667,595,905,813,974,612,723,810,1084,1044,990,688,1187,968,666,607,1178,1195,732,975,652,571,728,613,800,601,1067,954,1192,923,501,584,792,1160,834,1132,765,621,666,979,1085,813,1162,511,689,702,806,899,1157,1060,699,836,1102,951,570,548,739,795,673,1180,649,1008]
["Ford Cortina",827,1004,947,836,934,538,633,1163,793,849,578,737,998,1016,1155,803,1111,1141,806,1119,562,513,705,1087,1032,1014,581,883,1098,731,1094,1012,568,994,659,959,526,695,1162,578,1181,644,947,1200,552,968,526,1008,1014,674,995,798,876,909,666,763,933,577,794,1094,1023,719,624,521,788,1134,559,529,915,590,849,614,858,974,1005,892,891,1091,982,532,689,579,735,530]
["Ford Cougar",943,795,1161,858,1030,572,579,900,1176,806,816,769,686,1166,876,847,509,945,1162,1124,1157,1122,1186,895,1098,858,572,526,1114,683,589,701,793,840,637,912,744,660,828,1026,937,653,1107,628,504,882,1034,1084,710,594,1086,1124,1027,834,997,838,590,1086,680,1022,656,694,590,745,1164,875,1045,1188,650,782,1050,752,501,553,674,681,1077,1075,689,671,743,1109,679,1127]
["Ford Courier",1193,629,675,619,616,602,959,1024,526,624,1178,592,861,793,739,936,754,1169,798,1007,606,597,820,1102,949,1012,754,814,889,1087,908,680,887,1021,1121,524,536,715,807,794,1165,634,619,1124,1198,867,1040,860,670,743,677,1144,909,847,1145,1058,1021,789,1199,873,1027,1163,627,739,1067,987,566,1030,545,1165,968,520,756,910,1011,729,932,579,1077,634,606,694,1051,903]
["Ford Crown Victoria",845,948,1162,600,1056,1014,919,636,1098,515,1194,1097,556,792,832,547,949,544,1099,810,543,1072,883,1013,1185,775,1085,550,865,809,699,1119,922,1126,722,659,840,603,705,570,768,1003,1192,966,688,657,698,944,767,893,561,976,1084,879,1050,693,980,948,973,603,1032,1002,925,1090,869,561,1035,627,695,1148,817,623,610,668,1178,967,935,809,886,637,591,660,1119,1175]
["Ford Econovan",653,639,592,1005,816,745,870,999,798,978,903,1113,557,618,791,891,1093,998,798,1104,1182,1119,976,731,597,1044,1012,990,623,1086,657,950,759,797,857,1028,861,1080,1089,579,1171,1101,768,808,725,1058,1084,588,727,593,1035,1146,850,1001,588,768,653,811,1173,907,637,1108,949,938,690,977,696,811,507,926,1174,1176,902,1112,611,730,1171,544,742,1163,1184,1078,699,824]
["Ford EcoSport",676,724,585,1058,700,1109,575,836,553,747,1198,510,1166,1082,1084,600,1129,1020,1148,987,602,827,644,677,1062,522,1112,1156,1049,973,941,603,1175,662,713,950,789,906,658,783,696,1059,568,907,916,918,720,862,1039,608,666,728,737,524,550,794,842,1160,1136,969,1114,1018,754,684,919,570,674,773,894,1142,1021,1047,506,800,1117,699,1094,1044,1058,1098,776,737,648,927]
["Ford Edge",768,802,656,969,738,561,787,1161,959,739,635,594,851,878,528,917,599,787,927,1096,760,1160,1062,1087,703,1116,1181,513,750,554,749,1021,804,599,1107,1182,519,610,948,759,1124,517,570,611,871,513,776,835,921,1129,1085,580,1172,636,1027,823,1085,875,633,843,1178,1001,763,947,550,731,508,572,1082,646,936,554,932,1143,545,927,877,1029,642,736,1088,1185,645,1168]
["Ford Escape",1163,1041,880,1103,1051,535,1014,502,596,959,1138,639,696,1197,1040,1161,1004,842,932,607,1042,1048,625,1022,716,1192,973,538,591,1066,844,826,1114,658,1103,833,800,948,638,881,828,652,1078,787,521,1008,1150,870,857,1195,576,1064,870,1061,712,1166,1000,522,904,916,776,724,1094,883,748,1015,518,661,637,1137,661,606,589,1105,572,810,588,1138,569,1127,1017,960,864,1175]
["Ford Escort",534,876,529,1042,854,868,1195,790,1136,1016,874,584,702,1129,1049,764,545,1062,903,953,958,585,1066,1047,554,815,1060,1165,1082,615,812,700,925,884,831,994,963,1153,1142,925,567,569,847,541,841,762,714,642,1172,1136,922,723,1028,825,1089,1065,605,1034,502,656,935,1039,840,1060,1026,963,1024,744,933,876,530,744,985,883,1161,1135,691,1137,648,1019,851,567,580,648]
["Ford Escort (North America)",1032,734,1117,912,792,1075,781,848,614,976,1093,795,816,664,805,1071,506,1008,1179,1080,1111,1121,840,1099,795,1100,1190,983,659,549,521,1012,1034,625,644,571,670,1128,1182,964,596,1167,991,910,790,859,961,681,636,758,1177,813,1172,876,895,1082,893,723,680,1130,1138,788,1160,773,1172,819,547,1101,918,970,581,584,739,1057,536,708,1012,812,837,934,656,524,541,875]
["Ford Escort ZX2",693,1118,791,857,964,861,602,1067,946,724,970,566,937,1002,914,801,609,587,843,708,766,730,1184,797,1139,1143,1145,631,1155,928,552,1020,517,1052,1037,1075,794,716,1191,1138,892,635,505,882,829,527,505,721,685,533,913,759,950,613,796,1191,637,640,847,728,1063,860,816,938,754,740,999,806,625,1181,514,816,604,874,775,534,1155,565,723,1035,1050,897,730,703]
["Ford E-Series",884,684,858,690,1142,1106,719,994,537,585,821,1056,904,997,813,802,964,927,531,628,945,848,1086,1100,1019,991,1073,1124,998,834,875,505,663,752,744,931,1076,548,669,1069,1003,937,575,704,896,832,957,560,1175,981,1098,687,574,1023,1179,1130,1185,606,968,1159,1042,1098,1184,861,1127,529,1086,518,1003,866,766,997,874,1095,1008,1114,696,889,947,1088,946,506,888,1022]
["Ford Excursion",680,591,968,1146,692,1052,1050,1200,641,1048,629,719,771,823,866,781,1042,1124,678,824,691,559,681,922,719,894,704,643,671,849,1146,507,820,853,973,1151,921,621,990,1192,582,1043,1042,657,674,1013,543,849,666,897,729,905,756,917,1158,743,999,1156,1131,581,687,831,1010,666,1009,1031,641,1010,610,1151,1112,1019,758,1126,908,589,1133,576,951,529,1102,1104,1190,1046]
["Ford Expedition",892,627,624,511,942,602,838,764,681,868,951,960,1134,1183,759,657,823,673,1117,1106,824,1154,592,585,1152,590,698,726,1060,792,1152,788,866,818,1106,964,1061,551,987,924,1147,685,640,554,965,727,658,899,662,516,1185,606,845,779,558,1023,695,735,568,772,1163,1154,941,1180,927,548,630,570,847,826,704,944,1118,913,649,728,1185,637,1012,983,666,1141,543,508]
["Ford Explorer",626,954,517,577,688,555,686,1133,1076,1067,1006,776,878,537,530,812,1105,1008,704,772,931,835,1152,979,564,1141,735,1122,984,819,535,1197,1119,1140,1147,597,521,844,987,531,990,1073,1187,1188,1078,1028,552,902,1112,647,639,561,1164,1086,751,911,890,627,813,541,813,1145,598,521,705,1145,1098,1064,894,599,1072,800,1027,583,737,829,1140,652,903,1078,529,1059,558,610]
["Ford Falcon (Australia)",964,600,1115,825,516,795,1181,754,914,1122,1039,562,554,862,729,1032,1014,1200,958,539,937,616,1185,799,997,1146,713,1007,520,793,1101,559,599,808,1148,1047,519,554,717,1103,570,1079,565,950,836,695,949,716,562,963,622,1017,1145,1196,795,1101,941,593,827,874,792,680,926,705,1094,1064,991,553,971,812,748,864,736,1175,650,1093,500,627,528,1115,1099,1021,927,1138]
["Ford Festiva",1080,1003,789,1055,575,1061,1022,1057,1000,961,802,977,1044,709,1197,525,1082,976,1121,653,929,1023,1025,1066,1170,606,742,1163,654,715,982,933,1166,802,851,1102,1064,1138,816,851,1183,1103,645,943,624,918,963,1038,657,672,748,669,691,1060,572,1172,786,1159,817,516,680,1145,928,686,862,1147,988,591,914,1161,612,1063,691,1133,679,814,552,1097,763,1137,995,811,754,886]
["Ford Fiesta",1149,870,862,1140,726,785,623,1137,753,1151,840,586,1164,699,1163,918,555,680,640,793,754,733,631,755,652,804,786,743,615,786,1106,553,1109,916,860,526,903,770,1089,539,892,827,965,1088,720,553,552,519,798,932,612,821,724,827,688,1054,860,768,527,1078,666,993,955,504,567,685,705,720,879,845,1101,891,544,1192,727,1060,793,1064,595,1083,999,515,1004,622]
["Ford Fiesta Sedan",670,868,525,1096,1135,595,1031,1085,515,598,603,798,837,980,621,1179,991,1050,646,521,613,951,1037,1137,740,571,896,731,911,574,721,682,1171,793,869,1140,1031,1115,732,689,982,919,587,1063,1189,1056,542,615,1014,979,577,1080,1042,1120,725,638,1111,1046,1157,1097,801,959,1010,942,1094,1186,1168,1018,868,647,799,976,534,552,763,1079,1141,975,1060,1096,828,1142,655,653]
["Ford Fiesta ST",875,737,696,957,939,561,747,1097,664,1124,686,509,852,529,765,757,1130,959,1200,649,1094,1133,526,1160,1109,1096,1132,815,593,1114,588,602,1112,551,573,915,1000,975,638,728,840,871,1066,1140,1127,696,626,854,667,564,660,650,551,796,558,622,987,788,572,1018,1048,1110,961,1173,1139,526,548,952,1057,1033,631,879,1176,694,626,1181,915,1111,808,793,1025,936,997,884]
["Ford Flex",902,599,1160,604,612,840,738,672,548,528,1107,836,1144,952,886,718,1001,1187,566,562,1156,1113,842,1004,1108,976,1155,501,1105,1174,605,1009,541,1047,992,1140,885,838,980,775,660,1141,957,1166,1135,996,1039,584,782,893,844,593,750,978,576,1161,571,803,909,854,680,558,1053,704,644,1058,669,594,1041,658,1060,782,514,1118,581,534,626,1010,524,847,785,904,653,518]
["Ford Focus Coupe-Cabriolet",1089,973,720,1008,1055,577,606,732,622,1073,857,635,526,989,830,684,779,528,833,1053,634,636,670,745,1063,764,544,1168,1105,535,548,797,524,981,925,940,740,1018,1001,1091,1067,511,1036,678,1029,732,811,555,987,796,516,701,1035,543,589,759,905,847,1145,1152,608,918,649,894,809,931,845,696,1029,895,879,1188,788,943,515,620,743,1174,949,857,853,818,513,1129]
["Ford Focus Electric",895,931,776,942,1138,957,703,641,647,1040,785,738,1165,549,507,919,770,869,902,683,762,840,830,549,1163,826,835,930,1067,1113,1144,859,614,594,573,801,763,636,929,954,941,897,1101,739,760,691,1067,743,570,698,590,565,807,1183,1185,1063,1103,1192,613,1196,825,1099,1193,930,548,1083,1018,987,801,756,573,838,1106,944,846,603,552,619,921,704,733,810,1034,713]
["Ford Focus Hatchback",1098,532,831,562,597,1173,679,888,805,1006,658,790,1163,896,1169,697,952,576,664,1022,1182,1030,912,507,545,1100,1078,1005,680,816,556,586,1098,755,635,838,1036,1028,940,1168,595,1082,1171,594,1164,831,898,582,1089,631,555,739,941,516,1015,827,770,563,949,781,578,710,521,724,861,681,1101,500,835,949,657,1039,873,1125,655,1068,761,765,950,821,888,1148,980,875]
["Ford Focus RS",586,1114,563,1163,551,693,529,836,572,1019,1050,859,714,1042,544,1077,973,669,759,766,631,681,911,759,858,642,600,793,1098,972,513,943,1192,1142,755,530,1131,530,630,513,930,1187,832,737,598,978,861,842,954,607,904,681,777,743,893,934,775,518,538,968,793,1037,500,843,805,684,652,1038,1188,544,769,1018,854,793,1040,616,541,981,543,573,1147,929,1190,1035]
["Ford Focus Sedan",1044,553,877,590,594,1121,667,955,775,703,564,937,828,1121,1095,543,1014,539,974,1122,556,804,887,629,698,588,785,880,1075,525,588,585,869,559,998,1064,500,980,773,613,946,717,893,697,696,674,588,544,509,507,1115,994,961,1126,1069,581,534,867,799,894,850,1038,1167,687,522,1123,979,1048,736,1129,593,856,1184,866,1165,1136,649,723,1199,1189,908,609,1047,977]
["Ford Focus ST",612,509,1139,769,897,508,740,959,595,872,1070,680,1011,547,1050,1178,667,1003,741,829,873,821,882,534,662,573,927,1006,713,1009,1118,1116,1019,703,675,745,1105,520,1018,1134,849,960,613,681,695,995,505,720,1125,726,936,763,1052,1027,566,607,798,897,552,816,1114,1088,1033,1118,975,903,669,996,882,1174,1073,745,1097,714,1114,1082,804,1197,847,568,897,792,865,792]
["Ford Focus ST170",716,807,1128,1008,1149,867,849,764,1059,893,1079,677,583,975,508,954,964,1196,830,794,983,690,939,676,980,827,1018,699,1090,1023,732,583,882,717,883,924,870,1179,1068,1077,1101,1150,639,810,789,622,799,1172,1047,930,1112,640,803,962,1045,835,617,732,766,1191,532,818,949,580,573,1171,701,790,693,1117,618,1043,1059,572,903,1068,1032,1010,560,1176,806,906,1043,678]
["Ford Focus Wagon",730,1185,701,559,800,1097,724,754,1072,1178,882,853,892,1026,548,772,1106,706,897,1138,1191,714,514,679,1192,1112,1016,1096,916,501,721,1135,641,857,656,1028,925,747,577,683,625,794,570,725,1199,839,698,619,548,586,715,949,746,1137,648,876,870,1002,1036,1192,500,512,655,774,818,1025,1075,1177,712,1170,504,695,1009,756,689,1152,897,973,1117,938,579,1063,688,931]
["Ford Freestar",839,1167,1189,1040,659,1164,1128,1077,762,1030,507,987,971,861,987,539,901,761,519,1023,1042,1093,1032,860,837,712,1147,661,1034,683,897,536,872,1094,1088,1123,1035,813,537,1060,841,683,639,518,759,1112,1066,1154,796,738,587,759,941,624,1111,933,1124,531,1051,994,855,865,889,867,1085,920,861,944,609,880,637,854,956,1055,688,951,943,673,853,688,841,983,716,627]
["Ford Freestyle",653,679,764,500,1078,809,1000,1173,860,868,618,1091,541,707,546,564,1055,804,752,932,616,1184,666,665,758,926,1150,1148,962,781,1001,766,585,712,768,912,602,587,1124,1093,547,904,661,561,1181,761,514,805,864,803,972,740,1058,1185,516,739,793,966,600,738,741,791,963,942,718,819,607,744,1035,911,926,743,725,1002,1051,907,788,1044,504,529,690,938,922,908]
["Ford F-Series",1028,836,904,1148,809,634,774,506,720,745,1095,796,538,1119,852,904,554,770,1107,568,739,1141,981,889,1150,639,504,1146,1129,1009,977,1056,1142,902,1023,549,1024,1023,989,776,995,919,711,1054,916,899,573,954,1195,1140,865,864,665,846,843,924,1195,574,731,656,1097,508,673,821,987,1083,872,970,1073,751,1079,509,920,765,904,747,1015,899,580,908,637,756,595,1193]
["Ford Fusion",766,1109,598,1042,1094,1025,1003,944,1014,1093,621,849,910,549,1144,870,792,1012,897,960,904,772,1017,695,587,804,670,834,1064,1154,552,1152,709,513,677,1003,602,978,932,605,1003,650,774,854,828,957,520,610,886,813,725,869,1180,866,547,901,563,1045,553,661,641,1073,1178,603,912,668,937,605,1005,746,831,687,1052,891,1170,906,1176,625,656,1088,586,611,1058,580]
["Ford Fusion (America)",1078,973,884,688,758,625,704,1046,1006,802,824,926,1092,768,879,1155,742,1159,885,734,628,1147,988,1003,790,848,504,997,1074,572,735,582,1108,799,782,987,880,862,590,708,893,542,783,658,813,775,606,1134,900,1148,1058,870,1097,702,1141,863,1180,740,740,1099,529,696,715,1124,530,1175,657,1049,781,892,724,849,746,870,1030,866,961,601,1152,564,897,681,696,604]
["Ford Galaxie",905,809,790,987,593,845,1162,1053,533,564,717,1025,989,1038,740,677,1015,667,768,902,680,910,1000,905,904,602,581,717,671,1106,1018,1067,820,624,784,564,597,693,856,614,776,792,965,701,570,1047,1155,1179,951,1039,915,594,770,1122,1042,593,680,808,674,945,609,671,938,1092,1133,1135,1040,566,868,949,555,721,1044,966,718,549,751,666,954,817,769,1024,1117,1111]
["Ford Galaxy",929,693,1104,890,1033,575,562,1049,543,923,949,633,572,951,1067,738,579,850,1196,874,651,940,594,1165,575,646,672,1199,567,864,790,1113,927,1169,665,672,1018,935,556,1029,515,523,1090,678,1053,1007,1024,815,986,890,1112,980,799,1097,1182,856,1004,620,1108,1199,591,1070,620,740,624,758,581,815,928,744,593,1119,1027,1049,794,746,1000,1060,981,595,1105,944,550,514]
["Ford Granada",854,800,508,974,899,642,516,554,961,893,1044,796,653,658,872,538,700,970,833,979,929,989,965,634,1073,1031,909,820,795,1160,859,1117,777,1146,1065,682,940,1052,806,1096,522,1187,503,727,945,731,845,940,741,726,848,906,509,676,532,1027,671,722,1156,645,549,661,597,581,548,715,1184,1035,550,743,774,741,1025,752,998,762,1112,871,504,688,703,822,995,852]
["Ford Grand C-Max",663,786,727,794,1046,749,694,606,928,1094,662,1182,573,818,1069,692,621,1176,700,512,1138,998,581,987,999,1186,861,913,745,721,901,992,691,741,653,855,859,939,1032,818,723,845,934,1188,869,913,1150,848,1116,879,1093,852,636,616,661,610,918,755,855,1020,736,869,661,1014,787,675,518,573,786,1130,1038,792,1067,609,555,963,1182,1175,748,734,1128,923,735,759]
["Ford Ka",1043,524,678,719,645,1090,864,1188,1095,826,1111,727,658,909,1029,707,972,645,520,926,587,896,917,1088,681,956,528,646,918,1151,1026,947,608,962,901,1136,789,963,1109,762,1071,771,1191,1097,870,728,1167,891,581,767,571,577,871,645,508,614,572,612,1186,683,897,1101,750,1006,719,591,541,706,994,878,523,894,1030,1167,621,1168,936,728,672,1086,1111,643,924,1144]
["Ford Kuga",562,952,1118,1087,1095,1127,1034,508,1179,1158,1140,583,768,525,983,611,864,1034,1072,1028,1025,982,999,601,1069,842,752,703,550,787,1124,790,871,627,533,512,721,980,1189,650,936,786,1010,958,1114,551,666,827,847,706,889,591,561,1103,555,557,745,586,545,937,834,623,555,998,828,1031,1104,1099,878,598,913,1142,984,500,862,661,1137,1125,1087,908,671,1174,1109,713]
["Ford Laser",971,523,920,605,659,904,933,874,837,728,1133,874,586,915,556,1141,792,506,1072,572,784,791,640,1152,737,944,549,880,900,593,962,656,889,509,874,1171,1059,866,1017,881,1170,865,1090,1182,1020,1058,1087,1078,539,628,827,1041,504,670,667,1198,599,702,664,834,966,975,976,1178,726,1075,752,1194,634,929,673,881,1019,1110,641,1066,1187,740,1044,624,1120,530,983,1060]
["Ford LTD (America)",989,868,1022,802,896,1172,1179,869,708,640,772,618,935,1198,799,769,991,535,1096,1127,896,1195,833,913,562,586,633,719,691,545,1020,571,679,1064,904,762,912,1074,1150,766,504,1089,760,893,1061,796,769,716,716,910,588,1182,981,1194,763,1003,876,971,643,702,1171,1068,1107,705,715,749,870,976,706,638,682,612,799,1027,513,857,691,702,1052,1115,522,941,1088,569]
["Ford LTD Crown Victoria",753,927,803,982,528,502,847,691,1019,912,737,747,844,1133,593,531,1018,858,669,1103,645,1159,882,678,965,671,677,726,588,782,1108,731,869,559,550,840,867,534,1113,958,834,929,705,690,953,599,1054,842,940,860,634,975,1118,599,834,838,827,1155,870,1043,594,827,1091,657,636,1060,819,1046,735,1134,961,950,1083,992,695,813,550,855,651,1027,625,1092,537,965]
["Ford Maveric",1165,826,1032,807,677,761,620,1159,607,791,1127,751,573,511,1109,889,688,528,808,1150,602,1186,967,1072,896,1007,804,1152,826,774,1100,560,1041,962,1067,1184,1048,968,590,683,904,1103,1086,831,1058,876,1154,1182,635,809,692,539,874,683,1081,794,693,706,1033,1158,815,842,685,727,1174,1117,931,720,574,997,904,743,922,1003,501,630,589,628,650,904,762,977,1182,967]
["Ford kModel T",1108,990,1047,892,995,853,521,1027,989,739,589,880,921,870,1137,666,503,1092,981,1097,721,709,804,1024,592,1107,690,747,1095,516,852,703,799,699,752,824,927,530,1075,624,954,913,1185,1088,1012,1094,522,978,713,699,1004,967,1036,1061,645,860,920,803,1101,899,986,1199,690,518,610,1132,623,919,929,1007,751,913,703,657,1070,803,565,555,1196,855,1139,557,726,1085]
["Ford Mondeo",1156,634,1143,888,935,798,1027,1105,1095,959,1050,895,787,1143,532,765,686,700,696,524,1158,1136,951,1165,1148,781,1048,938,813,709,870,996,940,762,898,815,698,1091,756,629,679,1186,903,666,1184,623,585,1006,848,838,865,1050,1033,1195,645,1151,1006,501,712,901,780,660,632,611,535,652,661,908,1054,981,600,771,1101,884,969,1191,1043,1176,829,1116,705,1032,751,589]
["Ford Mondeo ST220",500,770,950,930,1197,822,1156,1164,1061,1112,762,1112,1165,859,1137,837,748,776,671,912,654,694,1046,913,989,522,625,1010,1051,698,875,614,805,533,805,1056,582,1129,900,956,953,1023,974,826,894,526,531,1131,977,860,1173,1115,1074,1041,1130,715,527,629,888,646,821,916,879,786,574,1198,507,545,1129,569,986,704,718,1163,820,790,1186,634,1175,1093,928,1023,888,702]
["Ford Mustang",517,1111,1053,1134,1138,1051,545,948,965,522,917,785,794,830,660,955,849,755,911,1116,641,1001,613,604,697,544,1013,661,781,716,955,544,1081,505,723,902,965,631,644,796,946,681,1137,1027,1041,1078,780,935,735,982,1123,1014,647,591,1185,536,615,574,1127,1119,609,1073,1184,1164,882,824,745,928,1191,946,1110,1133,818,670,759,1124,1008,531,1085,1177,853,1110,525,958]
["Ford Orion",1186,1170,917,797,513,796,571,807,1196,1087,804,1170,666,639,998,976,599,1139,632,699,696,551,891,520,712,507,623,1106,716,620,1110,720,508,1095,1176,803,667,1057,990,601,633,958,1147,606,922,1063,1108,957,1091,1019,856,896,1117,1123,691,743,929,1169,823,926,987,862,936,605,586,983,812,667,821,896,1069,786,594,560,1075,814,735,863,1152,703,912,976,639,936]
["Ford Probe",1189,525,1160,519,742,570,707,913,701,788,731,522,965,1140,720,930,695,985,536,1127,944,1070,596,574,904,1179,643,1200,734,1165,501,844,725,508,630,1087,720,838,897,721,994,849,886,625,1034,536,745,879,502,890,663,665,1157,715,910,763,957,554,1060,768,957,886,861,835,1124,623,831,1136,1161,1098,1110,588,841,1162,1158,1108,1023,845,938,865,807,511,525,757]
["Ford Puma",887,537,584,700,697,1195,711,550,662,652,793,693,1150,649,900,964,957,1039,963,1192,664,1074,604,917,831,1008,695,750,704,919,897,1104,848,1010,1181,782,961,968,597,903,548,1147,1114,701,734,925,1086,1200,807,789,543,559,506,1033,857,737,604,1022,804,891,753,577,649,1000,1083,1049,610,672,1171,545,844,1015,1188,874,645,982,519,753,1120,1116,1032,970,1195,1199]
["Ford Ranchero",919,523,754,1061,1155,686,580,1098,966,744,829,797,990,925,1114,829,1051,744,760,1050,585,725,775,951,697,944,939,865,919,563,1186,546,1046,658,1194,579,983,586,1107,826,835,624,996,590,1013,593,648,1027,874,1030,589,555,1091,545,903,1057,1104,761,768,892,1163,1180,709,958,864,504,510,1175,855,623,1058,1147,553,737,972,640,621,1176,816,820,1177,632,534,1155]
["Ford Ranger",1056,760,676,849,681,755,1029,974,1175,1030,567,1195,720,954,715,529,668,1079,835,1039,769,1065,1061,562,667,626,755,930,606,930,740,548,639,1189,1096,983,1112,679,523,596,946,983,823,625,1088,1083,907,863,1108,1144,526,513,1049,741,673,506,609,735,903,1002,597,624,640,1190,932,683,739,824,998,527,727,614,575,698,963,623,898,1114,927,674,758,1184,649,1137]
["Ford Ranger NA",999,896,661,693,715,835,826,714,905,727,590,650,1177,703,755,1064,937,559,1102,1125,871,952,636,1103,538,1169,605,714,679,1155,1019,1112,533,746,587,955,921,1180,682,508,860,1039,684,917,658,547,1163,652,1112,620,568,830,1148,1041,772,913,1105,976,634,661,558,506,822,943,915,657,887,622,934,642,514,851,660,972,616,640,598,702,1044,972,672,1179,699,895]
["Ford Scorpio",695,511,914,925,1000,1095,852,574,885,994,1119,516,675,1029,949,744,871,556,1012,878,664,646,935,1135,784,866,838,856,872,859,849,576,543,1123,581,599,1151,930,1067,870,510,881,741,1130,905,1116,598,650,780,973,581,782,986,546,622,681,957,1063,711,1077,537,1147,1078,719,769,1121,1148,708,947,644,699,892,609,1099,606,1011,719,930,557,853,758,835,990,658]
["Ford Sierra",1102,1053,667,692,1109,500,1018,877,781,876,725,874,671,1174,884,1079,804,516,639,789,583,697,721,1027,613,1034,1132,505,854,522,802,1084,1168,1125,596,640,665,1175,1160,738,960,605,1056,655,540,1144,752,604,514,685,960,1086,1073,560,942,945,618,773,763,525,1183,976,579,1116,525,877,648,639,1106,846,823,1181,786,987,1123,660,1085,891,788,1026,558,1161,642,524]
["Ford S-Max",1170,1147,654,868,727,1156,835,1074,960,907,675,879,977,1110,523,1144,778,548,618,1009,669,1030,709,651,953,1115,713,1045,1072,1002,513,1103,834,882,667,1154,547,741,870,793,914,1154,1154,717,1158,844,925,676,653,691,807,934,919,1185,1050,1198,1141,792,676,667,1046,1068,824,785,969,510,1111,783,700,698,713,630,748,1124,1015,874,872,788,1110,539,829,542,718,961]
["Ford StreetKa",717,1183,767,988,524,1053,1076,887,929,786,512,651,853,1026,1121,755,1110,1027,937,963,993,978,735,651,846,740,508,678,737,803,914,629,1033,1021,881,549,568,574,575,814,1026,959,665,1106,722,1024,1190,745,748,728,696,974,552,1095,1047,1038,770,823,760,778,1140,509,820,809,566,1186,896,689,1049,995,946,535,1010,1070,672,546,705,682,1112,534,774,908,655,1148]
["Ford Super Duty",652,1027,784,621,712,1163,997,642,954,972,655,1114,930,709,951,640,509,1123,733,1195,833,633,588,661,938,891,514,946,673,650,874,897,613,1170,747,872,875,989,1088,1126,833,756,944,1107,889,774,1186,1149,1014,563,714,1126,823,803,559,750,900,975,1064,1154,642,966,618,1063,743,944,1044,566,1127,514,825,1027,596,801,579,728,864,1109,790,1124,744,1011,500,728]
["Ford Taunus",809,810,1012,536,705,551,773,790,994,796,1190,765,731,707,698,1068,896,712,665,671,950,616,1018,509,1149,526,628,1081,510,993,610,887,1099,838,920,1160,683,799,639,848,977,847,717,837,1070,1077,952,1077,968,695,913,942,727,1007,985,1029,779,913,939,954,703,684,551,568,555,586,751,973,913,591,1030,1033,640,599,957,846,1142,551,722,934,505,1163,792,611]
["Ford Taurus",671,590,1099,867,897,611,961,932,1169,893,850,1156,1045,701,851,1178,1097,534,600,702,1048,795,583,820,538,610,651,757,1104,1140,831,705,1040,919,747,622,738,878,506,855,1018,1152,798,1066,1073,906,882,526,1121,809,1052,1118,579,763,1106,1116,634,1131,870,927,717,1056,791,608,553,671,901,624,540,1039,609,833,763,896,884,669,1126,905,852,1140,1016,562,706,605]
["Ford Telsar",744,1182,1012,1094,858,780,935,713,1037,1178,981,913,1050,1119,593,1064,1168,902,690,813,791,855,1134,565,569,1011,1006,528,828,825,816,1061,668,807,747,738,841,574,672,788,848,993,1030,802,778,858,836,1146,648,937,828,798,643,632,786,844,723,846,1026,613,1089,902,974,1116,1193,544,893,1110,618,802,1066,923,1182,927,798,690,1044,987,786,1182,1173,1000,834,522]
["Ford Tempo",882,510,672,685,635,938,938,1133,562,789,618,604,710,708,1122,755,1129,799,599,838,999,744,519,1015,973,1035,626,803,706,1108,717,834,744,1082,1079,866,670,750,764,1191,1027,717,1100,840,1063,758,812,855,839,977,719,504,554,739,1115,1068,538,1173,915,933,1001,776,1010,677,524,1085,989,941,822,921,1018,1055,541,1069,885,652,723,1135,887,1033,570,708,685,849]
["Ford Thunderbird",865,924,1185,633,1101,959,959,505,1016,983,979,1078,527,797,992,751,1117,978,803,1188,1188,1096,703,1072,896,810,1064,725,515,855,615,992,970,1169,1099,731,698,1166,821,731,795,543,1178,1074,1153,568,1115,985,772,1128,1153,752,592,515,1149,737,654,792,1193,624,833,537,934,858,762,778,787,1061,544,902,845,608,915,566,917,792,534,1113,507,1067,1022,1029,925,659]
["Ford Torino",894,647,1067,838,677,1079,574,819,853,941,780,734,751,1028,563,525,895,1055,932,1198,931,1032,749,893,1010,997,893,844,1184,512,1012,526,667,570,1113,799,1133,985,503,1146,706,1107,701,1131,740,990,526,956,878,878,532,597,731,864,992,1097,981,730,745,588,998,527,1055,666,853,558,867,788,752,859,1176,723,724,1147,1182,977,927,1138,581,868,645,1082,782,865]
["Ford Tourneo Custom",1015,547,731,1059,776,615,902,891,1171,653,659,757,900,951,508,552,780,503,508,1058,703,675,614,675,773,753,1180,604,891,996,1084,850,603,933,518,862,795,647,991,862,902,762,780,500,1110,1137,679,944,1000,838,722,751,836,977,910,1113,1051,863,1147,978,829,636,1115,568,532,818,808,772,589,1021,884,1162,731,1081,840,1043,802,732,846,741,738,870,634,966]
["Ford Transit",1000,1000,648,511,916,694,792,965,888,858,833,1137,1139,1057,1092,709,911,593,936,821,682,535,880,1093,1167,669,661,1134,820,722,518,983,1052,550,887,785,1093,915,818,973,1025,825,855,684,945,634,729,735,873,933,647,742,800,1168,616,1106,636,645,1078,827,784,762,728,895,1111,1148,1168,965,717,690,907,564,1088,1124,1167,562,554,934,868,696,787,866,695,884]
["Ford Transit Connect",1078,511,1134,778,1154,675,682,818,892,841,966,1157,608,1069,840,1113,1124,549,1075,1109,1010,1010,918,1032,909,565,565,1056,598,1191,1133,512,1031,586,510,850,799,831,742,725,1146,828,1032,809,927,953,1052,635,823,835,777,637,652,626,784,1029,905,709,845,792,635,790,1139,582,1040,561,627,1026,863,709,923,1025,1034,691,779,1161,758,800,743,505,1004,715,615,690]
["Ford Transit Custom",769,753,843,1183,544,565,921,670,979,612,615,825,1106,1053,1003,1131,817,990,1080,1191,743,1017,742,1192,1032,886,1183,859,775,1012,755,608,806,754,849,1073,971,930,1162,735,1061,1106,543,784,1087,509,977,922,722,502,967,923,900,533,1112,1032,615,1049,1194,833,721,984,956,566,789,569,556,826,590,991,826,874,1108,1048,965,962,747,1055,522,1091,504,829,829,679]
["Ford Windstar",673,584,1119,1042,1098,936,759,966,772,1004,617,610,1019,1174,790,928,556,529,706,1003,925,727,787,1131,922,513,880,1046,895,552,749,1000,846,1131,800,952,559,663,859,918,1149,680,967,686,907,552,1060,1040,974,875,957,635,513,637,807,890,636,782,780,1037,671,1150,660,568,711,1092,597,704,846,1198,911,514,635,668,794,844,940,782,1173,1004,1069,1171,811,694]
["Ford Zephyr",937,1069,927,690,686,775,1148,914,645,917,951,724,1030,768,1073,783,806,1179,556,812,640,617,824,766,626,696,610,561,659,839,935,593,742,953,1154,1178,1150,724,843,838,878,663,975,1158,1093,1123,1159,516,1197,920,643,788,578,847,535,507,797,1060,1169,693,1151,655,947,508,756,1076,510,815,545,1088,893,556,808,579,679,727,796,651,1039,913,1129,790,527,937]
["Ford ZX2",974,724,621,943,800,1173,618,735,858,891,612,1097,606,661,962,812,887,897,920,742,984,681,751,940,1058,938,508,735,982,584,1035,1200,640,656,838,919,1075,1070,1131,862,786,981,872,514,696,925,885,674,954,531,1164,566,570,532,613,1080,919,776,780,951,913,894,1173,698,514,646,530,1005,1142,763,1059,1164,554,1166,1029,1004,910,699,788,964,965,575,808,599]

{"sheet":"Jeep","index":12,"n_rows":12,"n_cols":85,"rows_kept":12,"cut":false,"hidden":false,"merged":[]}
["Jeep sells","2016-01-31","2016-02-28","2016-03-31","2016-04-30","2016-05-31","2016-06-30","2016-07-31","2016-08-31","2016-09-30","2016-10-31","2016-11-30","2016-12-31","2017-01-31","2017-02-28","2017-03-31","2017-04-30","2017-05-31","2017-06-30","2017-07-31","2017-08-31","2017-09-30","2017-10-31","2017-11-30","2017-12-31","2018-01-31","2018-02-28","2018-03-31","2018-04-30","2018-05-31","2018-06-30","2018-07-31","2018-08-31","2018-09-30","2018-10-31","2018-11-30","2018-12-31","2019-01-31","2019-03-01","2019-03-31","2019-04-30","2019-05-31","2019-06-30","2019-07-31","2019-08-31","2019-09-30","2019-10-31","2019-11-30","2019-12-31","2020-01-31","2020-02-28","2020-03-31","2020-04-30","2020-05-31","2020-06-30","2020-07-31","2020-08-31","2020-09-30","2020-10-31","2020-11-30","2020-12-31","2021-01-31","2021-02-28","2021-03-31","2021-04-30","2021-05-31","2021-06-30","2021-07-31","2021-08-31","2021-09-30","2021-10-31","2021-11-30","2021-12-31","2022-01-31","2022-02-28","2022-03-31","2022-04-30","2022-05-31","2022-06-30","2022-07-31","2022-08-31","2022-09-30","2022-10-31","2022-11-30","2022-12-31"]
["Jeep Cherokee",895,1266,967,817,1002,1293,914,1382,1275,1095,1310,1359,931,1408,1091,801,976,1139,1262,1350,862,846,953,1260,822,1126,889,1431,839,1381,1448,1120,1487,1473,1070,1339,1480,1314,1434,833,1080,1023,1112,956,1379,1109,1213,813,1484,1185,1359,937,1338,959,1056,852,1085,1060,1311,909,1309,1106,944,1221,1445,860,1440,1241,1375,1367,1070,1267,1305,969,1331,1312,1250,1287,1345,1254,852,1384,873,1342]
["Jeep CJ",866,1426,1362,1155,1297,1288,1299,1026,897,1240,1462,1172,1081,1498,1055,847,1185,1246,1090,1238,1435,861,1010,933,944,1417,1074,1443,927,1085,807,1084,1311,1310,892,973,1176,1291,839,1135,914,1417,1062,1180,916,887,956,1493,1396,1284,1160,913,1164,919,1365,1422,996,1389,944,937,1270,1446,1306,1198,861,1072,1352,1300,1483,1080,1003,1387,908,1361,839,1405,976,1151,971,1390,1131,1184,1229,1368]
["Jeep Commander",1453,1062,1338,991,855,1029,801,1054,894,1173,1481,1135,1253,1223,1228,1015,1087,1004,1394,1395,1300,1082,1137,805,1170,1498,1124,1054,1082,1310,1217,1262,1052,984,1222,1393,939,832,1257,804,989,1167,1006,964,1294,1056,956,1321,846,909,1068,1422,1227,1233,1055,1195,1200,840,997,892,1461,1211,948,1313,1356,876,1176,1470,1324,1196,1090,1463,1411,1019,1073,1361,871,1001,1185,1320,1266,1042,1310,838]
["Jeep Compass",1085,1198,1056,842,921,1239,1363,949,901,1082,1399,1088,817,879,956,1016,961,1153,1275,1171,1497,1126,1065,977,808,1402,1178,1010,956,1355,989,1096,856,989,1068,1497,1107,878,1030,1158,811,859,1311,917,1352,1197,1500,1198,1150,1291,811,1319,1419,836,1446,833,1442,1476,809,1320,1452,1010,1146,931,1117,957,1246,1063,1378,1182,1368,1444,1122,1493,1200,835,1460,1007,1053,1168,897,1446,1386,1349]
["Jeep Grand Cherokee",806,1066,1121,1320,1379,1165,1337,1191,1497,1145,1062,1117,1424,1308,951,1374,1296,817,1262,852,1291,1037,1231,883,1208,821,1470,1022,1350,951,1128,1069,1280,1433,1230,1132,872,1348,918,967,1448,1115,1373,1288,906,803,1324,1268,928,1097,1038,1007,964,1214,1201,1157,816,1203,913,1010,1436,1314,1274,1414,897,1402,972,1212,1012,817,1336,1079,1431,1151,1336,934,1337,1340,1440,1004,1327,926,936,1193]
["Jeep Grand Cherokee SRT-8",1144,1402,1015,1486,864,1339,1301,1445,1271,1366,1261,851,1462,925,976,1272,1372,1028,950,1447,1084,984,1020,1004,1384,832,962,1001,980,1440,1111,1424,953,936,1330,1460,836,1396,820,906,1307,1098,1350,810,941,1489,1300,1339,1189,1244,1020,1225,1233,873,823,1157,1150,1438,1245,1039,932,828,1446,899,1076,1448,869,1412,1235,863,1150,805,1192,1317,1485,1241,1183,1074,1458,1058,1060,1377,926,1388]
["Jeep Liberty",873,1199,1423,927,1068,1075,1094,886,1415,996,926,1399,1496,896,919,1094,1030,1062,1350,1001,973,1216,1152,1048,939,854,1024,1335,1049,1303,973,1204,1066,1349,1098,892,1191,1453,1292,1309,1208,1356,1219,1381,1466,1444,970,975,1119,959,1089,1380,1003,1247,1066,882,1105,1313,1076,836,1156,911,1413,1216,1148,935,912,1330,883,1097,1282,1424,983,996,1331,1438,1121,1073,1350,1198,1325,1249,920,969]
["Jeep Patriot",1054,1149,1078,923,1391,1024,1092,1364,1117,1193,814,1194,1337,1481,1407,1235,1389,1451,1059,1133,1382,1065,1326,1128,885,813,1215,1495,877,1152,1397,1246,1195,1237,1321,1372,1295,1257,1392,807,808,1061,917,1160,1448,1450,1122,1216,1408,863,1105,917,898,1227,1367,1482,1251,1352,1329,1161,885,1205,809,986,1259,1303,1000,1193,1321,1192,1343,887,1401,1205,946,1174,1080,894,1428,1074,814,1430,1301,1107]
["Jeep Renegade",1116,1002,1454,1231,868,998,1175,1033,1336,1115,1081,1015,983,1057,1429,1288,1194,1066,859,1131,1098,1087,1330,988,1405,1292,1116,913,1212,1376,1281,1059,884,1170,1232,1462,1074,1355,901,806,1488,1401,1145,887,1350,1464,1130,963,1142,835,873,1125,1386,849,1331,989,1364,1181,1482,1194,1334,1282,1018,864,1005,866,1024,1396,1128,1454,1468,1138,819,861,1076,822,854,1033,1306,1053,1018,939,1420,1065]
["Jeep Wagoneer",1431,985,975,1187,1281,831,886,1289,1150,826,1005,1031,1367,1127,1256,1056,924,1068,1333,935,1474,925,1024,1379,1440,1055,1378,949,1385,1338,1038,1177,1483,1342,1205,848,1455,1209,1214,1288,807,1150,1483,1071,1165,1480,1353,1104,973,1257,1474,1394,1062,1157,925,1436,1268,1459,935,1446,1078,1401,842,903,1255,1317,1118,1446,1033,1180,1005,821,1309,838,1135,1431,839,1442,1500,1291,1265,1087,1157,1398]
["Jeep Wrangler",834,1442,1027,831,1480,921,1121,965,1350,1288,1274,879,1467,949,1259,874,1229,1403,1130,1322,1442,1265,1050,1378,844,1400,1157,1497,943,1354,1338,990,1434,1479,1094,1480,1233,842,1112,1205,995,966,1029,1376,1074,1477,1458,1397,1146,1251,1127,1276,1374,1327,1044,836,1243,930,809,1453,849,1194,1172,1368,999,1072,1003,818,832,895,1483,883,1352,1109,820,1232,1231,1410,911,878,1079,1334,813,1005]

{"sheet":"Info_Read-me","index":13,"n_rows":163,"n_cols":3,"rows_kept":163,"cut":false,"hidden":false,"merged":[]}
[]
[null,"!!!","For correct functioning, you need to enable macros"]
[]
[null,"!!!","You can change ALL data and names to fit your needs"]
[]
[]
[]
[null,1,"You can change Sheet names, "]
[]
[]
[]
[]
[]
[]
[null,null,"and the report categories in the dashboard will change automatically"]
[]
[]
[]
[]
[]
[]
[]
[]
[]
[null,2,"If you change the title in every sheet (A1) "]
[]
[]
[]
[]
[]
[]
[]
[]
[]
[]
[]
[]
[null,null,"the title of the report table will be changed respectively  "]
[]
[]
[]
[]
[]
[]
[]
[]
[]
[]
[]
[null,3,"Don't delete the 1st row and better don't change the format "]
[]
[]
[]
[]
[]
[]
[]
[]
[]
[]
[null,4,"You can add comment in each paragraph/graphic of the report "]
[]
[]
[]
[]
[]
[]
[]
[]
[]
[]
[]
[]
[]
[]
[]
[]
[]
[]
[null,null,"To delete all comments, just push the button"]
[]
[]
[]
[]
[]
[]
[null,null,"To delete just one comment, just replace it with \" \" space"]
[]
[]
[]
[]
[]
[null,5,"The graphic shows the data of the current year up until the selected month, as well as the results of the same month in the last 5 years"]
[]
[]
[]
[]
[]
[]
[]
[]
[]
[]
[]
[]
[]
[]
[]
[]
[]
[]
[]
[]
[]
[null,6,"If the report form doesn't fit your window, just maximize your Excel window and push the button shown below"]
[]
[]
[]
[]
[]
[]
[]
[]
[]
[null,7,"All numbers have been input randomly."]
[]
[]
[]
[]
[]
[]
[]
[]
[]
[]
[]
[]
[]
[]
[]
[]
[]
[]
[]
[null,8,"You are allowed to input no more than 199 data rows in each sheet, more rows won't be analyzed."]
[]
[]
[]
[]
[]
[]
[]
[]
[]
[]
[]
[]
[]
[]
[]
[]
[]
[null,"The End"]